program: Gaussian 09
title: 000241826
version: EM64L-G09RevD.01
frameworkgroup: C1[X(C13H16N4)]
method: RPBEPBE
basis: SDD
operation: Freq
keyword: #pfreq=noraman
keyword: PBEPBE/SDD
title: #p freq=noraman PBEPBE/SDD
converged: NO YES NO NO
title: Mulliken charges:
elementType: N N N N C C C C C C C C C C C C C H H H H H H H H H H H H H H H H
charge: -0.470945 -0.130999 -0.112850 -0.590598 0.387161 0.461189 0.333319 -0.696871 -0.351365 -0.423253 0.289103 -0.816908 -0.816975 -0.502078 0.277202 -0.045609 -0.779156 0.218574 0.307376 0.224621 0.304128 0.226717 0.226088 0.225937 0.222502 0.229953 0.222690 0.221071 0.227726 0.252683 0.228516 0.322465 0.328585
chargesum: 0.00000
title: Mulliken charges with hydrogens summed into heavy atoms:
elementType: N N N N C C C C C C C C C C C C C
charge: -0.166817 -0.130999 -0.112850 0.060452 0.387161 0.461189 0.333319 -0.478297 -0.043989 -0.198632 0.289103 -0.138165 -0.141830 -0.281007 0.277202 -0.045609 -0.070231
polarizability: 3.00340617e+02 -1.77865960e+00 1.87866211e+02 4.10780259e-02 -4.45283814e-03 8.19014509e+01
1716.lowfreq: -90.4575 -11.8851 -9.4369 -2.2443 -0.0009 -0.0007 0.0003 29.0914 38.6978
frequency: -90.4521 28.9520 38.6109 84.0350 114.0033 122.1962 160.6722 179.2492 193.4443 209.2580 210.5428 228.1845 239.1342 287.0787 309.2176 337.2707 406.7860 444.2902 445.9846 462.3826 505.2431 528.3019 536.0053 564.1559 569.2742 584.8011 603.9392 623.8909 674.7775 694.2338 723.6764 746.0397 763.0686 773.5856 824.7944 847.5556 868.3543 898.5184 919.8301 946.4581 979.2410 989.3820 993.0702 1007.3997 1028.7633 1046.6976 1051.5498 1063.1728 1104.5690 1127.4438 1172.5333 1195.7533 1228.8838 1264.4608 1278.1917 1301.9923 1336.6264 1382.8994 1389.8040 1390.4803 1402.3137 1406.1557 1416.2927 1460.7935 1462.1330 1468.5793 1469.1071 1474.6043 1477.9611 1481.8287 1504.4523 1508.4730 1559.9279 1568.0545 1598.8171 1609.8219 1630.6700 2965.0632 2969.2348 2987.4911 3035.1496 3042.6812 3067.7321 3079.4043 3082.2232 3094.5130 3118.7156 3121.9189 3146.9518 3199.8242 3536.9284 3564.3523 3724.7788
redmass: 1.0253 3.6839 4.3939 4.4538 1.1542 2.5171 1.1458 3.7197 3.5051 4.2503 4.3619 3.9670 3.8829 2.5029 3.1121 3.5318 3.1235 1.2236 2.7079 2.8787 4.8581 1.1096 5.3842 1.8892 6.1994 3.4134 5.6615 1.5661 4.1807 5.5837 2.5497 4.1256 5.5828 4.4611 1.7280 1.2918 1.5739 3.2486 8.5356 2.0458 1.3226 1.7241 1.6621 1.7235 1.4397 1.5827 1.6389 2.7972 2.4036 1.9131 1.6185 1.6915 1.7692 2.3795 4.3637 2.1084 3.3534 1.7283 1.7732 1.3645 1.5138 2.9263 2.4508 1.0473 1.3101 1.1436 1.0469 1.0460 1.2085 2.7067 2.5670 3.5310 5.6849 3.1433 2.6222 1.9188 6.0736 1.0377 1.0376 1.0379 1.0970 1.0969 1.0974 1.0982 1.0978 1.0905 1.0984 1.0905 1.0927 1.0941 1.0753 1.0440 1.1058
irintensity: 0.3490 0.0370 0.2285 0.1979 0.0037 1.2836 0.1706 4.2553 7.0548 1.9907 1.7955 0.6642 8.5748 1.6010 4.7017 0.1114 5.7510 292.3776 0.0377 0.6063 4.0315 9.5738 5.8790 15.8947 3.0576 10.2200 0.0381 46.4682 1.7667 0.7954 2.2032 0.1786 0.7059 2.0598 61.8526 28.4770 36.3807 7.1469 9.4281 2.7146 7.7465 13.1887 1.2263 14.1234 14.6918 8.9969 0.1016 7.7133 0.1621 1.7723 3.7382 19.3953 25.7146 9.5717 21.9165 10.5069 7.4993 50.7746 20.0435 1.2543 54.7810 39.5719 14.8094 0.2394 199.9218 39.4856 17.0198 29.8878 4.6470 81.9364 78.8829 401.3839 1087.1983 78.2151 134.0148 337.1905 55.6590 70.9269 36.3100 21.1542 37.4053 11.2947 19.6330 34.9625 4.5217 29.8983 11.9335 20.9582 7.9096 10.2469 19.1018 92.9203 42.5560
temp: 298.150 k
press: 1.00000 atm
elementType: 7 7 7 7 6 6 6 6 6 6 6 6 6 6 6 6 6 1 1 1 1 1 1 1 1 1 1 1 1 1 1 1 1
symmnumber: 1
zpe: 707397.7 jmol-1
zpe.correction: 0.269434 hartree
zpe.thermalcorrener: 0.285330 hartree
zpe.thermalcorrenthalpy: 0.286274 hartree
zpe.thermalcorrgfe: 0.225892 hartree
zpe.sumelectzpe: -722.796280 hartree
zpe.sumelectthermal: -722.780384 hartree
zpe.sumelectthermalent: -722.779440 hartree
zpe.sumelectthermalfe: -722.839822 hartree
dipole: -1.1822 -1.1638 0.0410
dipole: 1.6594
quadrupole: -94.2782 -80.5711 -107.0770
quadrupole: 0.8485 0.1354 0.1131
quadrupole: -0.3027 13.4043 -13.1016 0.8485 0.1354 0.1131
hfenergy: -723.0657137 hartree
pointgroup: C01 [X(C13H16N4)]
dipole: -0.4730996 -0.4496906 -0.012743 debye
polarizability: 300.1735045|-3.8835503|187.7508439|3.8184559|4.7086231|82.1839312 unknown
InChI: InChI=1S/C13H16N4/c1-8-4-5-11(6-9(8)2)16-12-7-10(3)15-13(14)17-12/h4-7,16H,14H2,1-3H3
charge 0 multiplicity 1
33 atoms
N  0.137271 -1.01044 0.020556
N  1.631272 0.853094 0.128327
N  4.060911 0.471388 0.157839
N  3.153985 2.624201 0.234841
C  -3.588271 -0.708587 -0.034547
C  -1.133289 -0.373927 0.025623
C  -3.786226 0.705211 0.02795
C  -2.274374 -1.222476 -0.034889
C  -1.327573 1.029156 0.087696
C  -2.643532 1.537452 0.087434
C  1.430511 -0.496912 0.064852
C  -4.774908 -1.653934 -0.100916
C  -5.182152 1.301879 0.029909
C  2.529866 -1.41262 0.04248
C  3.834196 -0.880774 0.092727
C  2.939562 1.265678 0.169102
C  5.05679 -1.773095 0.079388
H  -2.133365 -2.311618 -0.083002
H  -0.456889 1.682749 0.134748
H  -2.784367 2.624411 0.135157
H  0.097081 -2.030596 -0.024209
H  -4.451527 -2.707741 -0.148225
H  -5.432381 -1.542267 0.782781
H  -5.403162 -1.453138 -0.989995
H  -5.781909 0.943142 0.889045
H  -5.142487 2.403036 0.08602
H  -5.746265 1.032403 -0.88441
H  2.369375 -2.49385 -0.010905
H  5.081893 -2.402907 -0.828936
H  5.964992 -1.151775 0.106341
H  5.064061 -2.451682 0.952356
H  2.359651 3.256577 0.258751
H  4.110059 2.965165 0.277413
