program: Gaussian 09
title: 000241825
version: EM64L-G09RevD.01
frameworkgroup: C1[X(C12H14N4)]
method: RPBEPBE
basis: SDD
operation: Freq
keyword: #pfreq=noraman
keyword: PBEPBE/SDD
title: #p freq=noraman PBEPBE/SDD
converged: YES YES NO NO
title: Mulliken charges:
elementType: N N N N C C C C C C C C C C C C H H H H H H H H H H H H H H
charge: -0.463867 -0.133436 -0.112357 -0.590317 0.434771 0.290859 0.452009 -0.462282 -0.327029 -0.375431 -0.389732 -0.500466 0.277403 -0.811565 -0.044678 -0.778735 0.302368 0.213581 0.306506 0.227713 0.224051 0.221204 0.223754 0.221313 0.233153 0.228048 0.252842 0.228707 0.322553 0.329061
chargesum: 0.00000
title: Mulliken charges with hydrogens summed into heavy atoms:
elementType: N N N N C C C C C C C C C C C C
charge: -0.161500 -0.133436 -0.112357 0.061297 0.434771 0.290859 0.452009 -0.248701 -0.020523 -0.147718 -0.165681 -0.279262 0.277403 -0.133345 -0.044678 -0.069138
polarizability: 2.81446008e+02 -1.49212614e+00 1.75268582e+02 -6.01759040e-01 -1.13521282e-02 7.29591218e+01
1716.lowfreq: -84.8281 -14.6045 -0.7497 -0.0007 -0.0003 0.0002 5.5693 7.7339 38.3178
frequency: -84.8257 -14.2084 38.0901 45.8011 89.0812 125.9226 181.7178 203.4189 220.1333 224.2054 243.7015 309.0378 334.6919 351.6863 411.7927 443.4560 446.9825 510.1145 521.3397 526.2374 536.8909 574.7866 594.3329 616.0773 633.3089 674.9346 713.5242 718.1003 753.4470 773.8643 817.7632 826.5285 828.1237 853.3470 919.9351 928.1645 939.6205 984.7637 989.7250 994.2864 1009.2395 1046.0033 1046.7699 1062.7965 1098.3183 1128.1036 1183.6515 1191.3865 1222.9426 1259.6629 1274.7268 1307.0207 1340.4483 1383.1133 1392.3813 1396.8185 1412.4095 1417.0810 1462.1711 1469.0823 1470.6214 1473.0235 1481.5876 1497.3490 1515.2965 1560.1840 1564.7875 1598.5688 1610.9285 1631.0825 2969.7394 2986.3016 3049.7954 3066.3880 3079.5515 3098.6579 3117.9428 3120.4057 3132.3175 3143.7350 3196.1960 3536.8912 3563.2770 3723.5185
redmass: 1.0255 1.0178 4.0037 4.1128 4.5111 3.9736 4.6162 3.8317 4.1236 5.7875 3.9976 3.1580 3.6864 2.8423 2.9720 1.2129 3.0311 2.2853 5.6943 1.1143 5.2625 2.2748 5.9289 1.4787 6.7843 4.2595 5.7467 2.9828 4.4201 4.6051 1.5054 1.6911 5.5359 1.2889 8.4941 2.2459 1.3480 1.4387 1.3209 1.9714 2.8041 1.5384 1.5831 2.7972 2.4113 1.3890 1.4405 1.1659 2.6077 2.4324 5.5271 1.6285 2.7694 1.6329 2.5580 1.2342 3.0309 3.1258 1.3483 1.0471 1.1476 1.0546 2.8447 2.2628 3.3983 5.1317 3.6855 2.2732 2.0547 6.4075 1.0389 1.0379 1.0947 1.0974 1.0995 1.0879 1.0984 1.0908 1.0957 1.0927 1.0939 1.0753 1.0440 1.1058
irintensity: 0.3605 0.5507 0.0245 0.2666 0.1602 0.9226 6.0904 8.4023 2.3007 4.5126 1.6297 5.0483 0.0531 1.5796 0.3523 282.4199 3.5800 46.1416 8.4612 1.8779 2.4783 0.1507 0.4469 54.2269 1.0682 1.8602 1.7859 0.8488 0.3792 2.8641 52.1754 70.8688 0.6047 21.0338 8.9123 13.8392 3.7313 1.2860 4.6596 1.0922 1.2815 20.3710 10.0877 7.1376 1.9507 9.9408 8.0024 4.2991 0.7935 41.7339 25.3938 7.7806 3.2445 62.4986 38.8506 2.9565 59.5186 8.0887 165.6614 17.3680 55.6262 12.4218 66.9272 106.4839 415.8738 965.5041 113.2837 159.4292 332.0837 27.5249 58.2197 20.6475 26.1184 19.4403 19.5882 21.5569 11.6727 26.2068 23.1542 8.2548 10.4552 19.0974 92.8116 42.3881
temp: 298.150 k
press: 1.00000 atm
elementType: 7 7 7 7 6 6 6 6 6 6 6 6 6 6 6 6 1 1 1 1 1 1 1 1 1 1 1 1 1 1
symmnumber: 1
zpe: 635164.5 jmol-1
zpe.correction: 0.241921 hartree
zpe.thermalcorrener: 0.255451 hartree
zpe.thermalcorrenthalpy: 0.256395 hartree
zpe.thermalcorrgfe: 0.201218 hartree
zpe.sumelectzpe: -683.567898 hartree
zpe.sumelectthermal: -683.554368 hartree
zpe.sumelectthermalent: -683.553424 hartree
zpe.sumelectthermalfe: -683.608601 hartree
dipole: -0.6408 -0.9720 0.0631
dipole: 1.1660
quadrupole: -89.1591 -73.4944 -100.9025
quadrupole: -1.1336 -0.2686 -0.0009
quadrupole: -1.3071 14.3576 -13.0505 -1.1336 -0.2686 -0.0009
hfenergy: -683.8098193 hartree
pointgroup: C01 [X(C12H14N4)]
dipole: -0.2637728 0.3752701 -0.0046538 debye
polarizability: 281.2386989|4.7654052|175.2583051|-2.036392|4.467675|73.1767077 unknown
InChI: InChI=1S/C12H14N4/c1-8-3-5-10(6-4-8)15-11-7-9(2)14-12(13)16-11/h3-7,15H,13H2,1-2H3
charge 0 multiplicity 1
30 atoms
N  -0.089314 1.137058 -0.028723
N  1.274442 -0.823348 -0.134494
N  3.724322 -0.606735 -0.159175
N  2.674835 -2.693358 -0.23863
C  -1.400091 0.589945 -0.0326
C  1.166464 0.53703 -0.071919
C  -4.121648 -0.324283 -0.027687
C  -2.481739 1.513376 0.019691
C  -1.690138 -0.799974 -0.079767
C  -3.814532 1.060027 0.023354
C  -3.033298 -1.231633 -0.074737
C  2.324512 1.376751 -0.0490
C  3.590164 0.757754 -0.094745
C  -5.560209 -0.811502 -0.055824
C  2.552122 -1.323556 -0.175249
C  4.870171 1.565362 -0.076608
H  -0.059913 2.157718 0.013807
H  -2.277174 2.59196 0.062324
H  -0.860972 -1.50682 -0.115414
H  -4.629111 1.793296 0.06742
H  -3.238088 -2.309282 -0.108104
H  2.236493 2.466628 0.002306
H  -5.66192 -1.800281 0.426028
H  -6.23671 -0.109714 0.463935
H  -5.930304 -0.914533 -1.095075
H  4.93588 2.18936 0.833807
H  5.734401 0.884169 -0.103855
H  4.925035 2.244805 -0.947324
H  1.840211 -3.271925 -0.255295
H  3.606111 -3.098394 -0.270545
