program: Gaussian 09
title: 000241812
version: EM64L-G09RevD.01
frameworkgroup: C1[X(C17H10FNO2)]
method: RPBEPBE
basis: SDD
operation: Freq
keyword: #p
keyword: freq=noraman
keyword: PBEPBE/SDD
title: #p freq=noraman PBEPBE/SDD
converged: YES YES NO NO
title: Mulliken charges:
elementType: F O O N C C C C C C C C C C C C C C C C C H H H H H H H H H H
charge: -0.207503 -0.174627 -0.178093 -0.356143 0.298605 -0.690776 0.195970 0.303863 0.194176 -0.571893 0.530891 -0.400742 -0.379027 -0.581401 -0.358891 0.346450 -0.386986 0.149007 0.151918 -0.253370 -0.252849 0.254032 0.251130 0.278130 0.242681 0.267186 0.270328 0.245769 0.255583 0.278398 0.278184
chargesum: 0.00000
title: Mulliken charges with hydrogens summed into heavy atoms:
elementType: F O O N C C C C C C C C C C C C C C C C C
charge: -0.207503 -0.174627 -0.178093 -0.356143 0.298605 -0.185613 0.195970 0.303863 0.194176 -0.293763 0.530891 -0.158061 -0.111841 -0.311073 -0.113122 0.346450 -0.131403 0.149007 0.151918 0.025028 0.025335
polarizability: 3.32413976e+02 -4.52446748e-01 1.95972802e+02 -2.63918083e+00 -3.18165514e+00 9.02267687e+01
1716.lowfreq: -7.7471 -2.4401 -0.0006 0.0004 0.0006 2.8810 32.1436 37.3391 77.8693
frequency: 32.1369 37.3145 77.8691 89.3896 123.7935 142.3317 182.4269 196.0073 218.6633 239.1190 282.1535 288.0140 328.0264 356.8693 397.5400 415.0257 422.2884 440.0292 458.2469 511.0411 527.2958 553.6045 566.2827 579.7690 597.9756 617.9761 628.9335 680.8586 683.7198 705.5385 712.7337 734.2541 754.4582 758.0567 818.2263 823.9802 835.9268 847.3527 860.7718 886.7087 917.2199 941.9761 946.2098 953.7953 964.1799 972.7059 996.6044 1004.3290 1058.4678 1092.3499 1096.1256 1124.5685 1134.7010 1135.3161 1158.2317 1198.2864 1206.5165 1214.5590 1255.0758 1284.3722 1286.6711 1306.1627 1349.8180 1377.9584 1383.5448 1425.0925 1438.5448 1452.7204 1463.2717 1494.9078 1589.4259 1591.4676 1596.7384 1622.3917 1624.1044 1629.8577 1675.7551 2986.9044 3031.8858 3140.4341 3145.1916 3164.0387 3173.3767 3178.3597 3186.2826 3206.8911 3235.3356
redmass: 7.3717 6.1314 6.3280 7.8232 7.6599 4.9369 7.9625 8.0636 7.6635 2.2259 4.2396 6.7953 8.1724 8.4976 5.6748 5.5546 2.6827 3.2615 9.1827 3.9942 3.3774 5.1173 4.3634 7.2883 3.1982 7.5799 2.4887 6.6425 7.5006 3.5889 5.8082 7.1028 5.8237 3.2588 1.4843 1.7434 1.6787 5.1079 1.4640 1.4411 3.7879 1.3115 1.4183 1.5617 1.8297 3.5252 6.8346 4.2310 1.2551 2.5490 2.8030 1.7321 1.1684 1.6765 1.5528 2.0502 1.7243 3.4085 1.9937 1.6752 1.7182 1.9536 6.8510 7.6510 4.2526 1.1383 4.8635 4.7688 2.7555 3.9084 7.2735 7.0057 7.7627 10.6724 7.9124 7.4045 11.4914 1.0609 1.0994 1.0906 1.0899 1.0933 1.0928 1.0959 1.0948 1.0894 1.1110
irintensity: 0.2621 0.1672 3.1110 2.4659 5.1743 1.5282 1.0973 0.4188 1.1970 10.3767 0.0756 1.6255 1.2820 18.2148 4.1579 5.7966 10.0731 0.8905 3.2428 0.5641 1.6392 1.1230 3.1814 2.1206 0.3353 19.5139 6.9981 3.1830 38.1222 17.0513 7.2182 2.3028 2.9303 2.4376 17.3034 92.8493 31.2377 4.9092 30.9559 2.9079 27.7753 0.0822 1.9418 3.3218 12.0031 8.9297 8.0104 14.5081 34.5015 35.7293 45.2077 24.0910 0.0973 0.6619 15.5948 7.7387 46.4464 12.5419 71.4887 21.1150 1.6314 11.5264 360.4915 19.6287 1.1415 15.8015 38.6211 38.5665 212.6397 24.0902 26.1181 15.2323 19.2881 344.3654 66.5272 18.3343 9.4878 9.5197 5.2886 7.5738 9.8752 3.1818 1.4848 6.6147 2.6356 0.0145 0.9887
temp: 298.150 k
press: 1.00000 atm
elementType: 9 8 8 7 6 6 6 6 6 6 6 6 6 6 6 6 6 6 6 6 6 1 1 1 1 1 1 1 1 1 1
symmnumber: 1
zpe: 585126.0 jmol-1
zpe.correction: 0.222863 hartree
zpe.thermalcorrener: 0.238780 hartree
zpe.thermalcorrenthalpy: 0.239724 hartree
zpe.thermalcorrgfe: 0.178730 hartree
zpe.sumelectzpe: -957.452462 hartree
zpe.sumelectthermal: -957.436544 hartree
zpe.sumelectthermalent: -957.435600 hartree
zpe.sumelectthermalfe: -957.496595 hartree
dipole: -3.1989 -0.2993 0.0499
dipole: 3.2132
quadrupole: -111.1942 -117.3807 -122.9957
quadrupole: 6.3988 -0.6621 -9.7595
quadrupole: 5.9960 -0.1905 -5.8055 6.3988 -0.6621 -9.7595
hfenergy: -957.6753245 hartree
pointgroup: C01 [X(C17H10F1N1O2)]
dipole: -1.2589052 0.1139293 -0.0183416 debye
polarizability: 332.4137477|0.8638266|195.9939945|2.4686795|-2.8750943|90.2058047 unknown
InChI: InChI=1S/C17H10FNO2/c18-12-1-3-14-10(8-12)7-11-9-13(2-4-15(11)14)19-16(20)5-6-17(19)21/h1-6,8-9H,7H2
charge 0 multiplicity 1
31 atoms
F  6.55627 0.525355 -0.172887
O  -3.886938 -2.119213 -0.84751
O  -3.334002 2.258095 0.833999
N  -3.172409 0.00804 0.010192
C  0.503998 0.681194 -0.19219
C  1.636472 1.664274 -0.464251
C  1.038062 -0.595197 0.16006
C  2.882039 0.817044 -0.235426
C  2.50928 -0.51369 0.132934
C  -0.879887 0.893627 -0.255773
C  -1.746582 -0.1874 0.055847
C  0.169023 -1.666436 0.459472
C  -1.225025 -1.458257 0.414554
C  4.234548 1.18305 -0.34281
C  3.496863 -1.489035 0.397529
C  5.189794 0.183952 -0.071642
C  4.861309 -1.135592 0.293974
C  -4.133405 -0.96284 -0.431985
C  -3.859661 1.206944 0.397524
C  -5.485139 -0.313126 -0.30191
C  -5.32604 0.947165 0.179526
H  1.598215 2.535069 0.218972
H  1.596548 2.068826 -1.494421
H  -1.290434 1.870653 -0.521793
H  0.559536 -2.652819 0.731278
H  -1.908365 -2.279569 0.641381
H  4.556358 2.190458 -0.622338
H  3.220535 -2.510347 0.679375
H  5.660252 -1.856537 0.4887
H  -6.397526 -0.842272 -0.576509
H  -6.07589 1.706185 0.401927
