program: Gaussian 09
title: 000241813
version: EM64L-G09RevD.01
frameworkgroup: C1[X(C17H12BrNO3)]
method: RPBEPBE
basis: SDD
operation: Freq
keyword: #p
keyword: freq=noraman
keyword: PBEPBE/SDD
title: #p freq=noraman PBEPBE/SDD
converged: YES YES NO NO
title: Mulliken charges:
elementType: Br O O O N C C C C C C C C C C C C C C C C C H H H H H H H H H H H H
charge: -0.019521 -0.254413 -0.415978 -0.246778 -0.482588 -0.824579 0.390002 0.198116 0.344548 0.202005 -0.518563 -0.383863 -0.384189 -0.394593 0.519080 -0.481749 -0.236932 -0.224506 0.234598 -0.300760 -0.209749 0.169687 0.325211 0.330998 0.245609 0.255543 0.241403 0.226461 0.231961 0.230029 0.313084 0.245584 0.291759 0.383084
chargesum: 0.00000
title: Mulliken charges with hydrogens summed into heavy atoms:
elementType: Br O O O N C C C C C C C C C C C C C C C C C
charge: -0.019521 -0.254413 -0.032894 -0.246778 -0.169505 -0.499368 0.390002 0.198116 0.344548 0.202005 -0.187565 -0.138254 -0.128646 -0.153190 0.519080 -0.255288 -0.004971 0.005523 0.234598 -0.055176 0.082010 0.169687
polarizability: 5.02286693e+02 -3.31272210e+01 2.31053442e+02 6.65788535e+00 1.97680522e+01 1.04023917e+02
1716.lowfreq: -3.4143 -1.0005 -0.0005 -0.0004 0.0007 3.9287 20.2838 31.3111 41.5440
frequency: 20.2780 31.2955 41.5425 48.0718 72.3254 80.6755 95.9752 124.9181 141.3411 156.5209 168.0966 184.7235 225.4524 247.7675 262.3245 280.0464 347.2863 355.3533 402.0877 416.7082 446.5075 480.6893 488.9482 518.7202 559.8051 570.8102 579.4438 590.2246 604.6829 643.8613 648.0728 650.3669 665.1953 709.9594 729.9592 746.9919 750.3171 766.5107 780.1403 793.6323 832.0012 841.9626 884.5043 908.2404 917.3540 941.9892 949.7738 954.3985 958.3281 968.5791 990.3124 993.6348 995.3096 1025.9686 1059.2815 1096.4753 1120.6257 1126.0640 1138.0799 1160.1660 1171.9782 1183.2117 1201.5896 1219.4011 1224.4133 1272.3692 1287.5370 1305.1759 1312.0240 1329.1767 1368.5381 1387.6407 1443.8359 1452.2600 1459.9492 1489.0017 1511.4574 1590.5374 1594.4059 1599.1168 1617.8601 1624.3766 1630.4040 1659.4463 3083.7935 3108.3259 3116.2918 3128.0062 3137.6250 3148.7893 3151.1186 3166.3578 3169.9883 3185.8880 3521.4490 3521.7817
redmass: 7.5057 10.7709 8.9225 7.3855 7.5981 9.3035 6.0150 6.2989 4.6993 4.0798 6.8512 3.2833 7.7956 7.1532 4.4053 9.0059 6.5461 4.1416 6.0158 3.6367 3.0996 4.2949 4.8614 4.6779 5.0474 1.7739 5.9019 2.9784 6.3390 1.4081 2.2221 4.0995 3.0375 5.7805 8.5245 1.9956 5.2771 3.4914 2.5459 3.5631 1.6134 4.4549 1.4974 2.1869 5.1381 1.8463 1.4468 1.4161 2.1038 4.2037 1.3645 1.0882 5.9212 2.1045 2.1896 2.1378 1.4577 1.4411 1.6210 1.4553 1.1775 1.6483 2.1037 1.4572 1.7452 2.1058 1.5489 1.7644 1.8922 2.5504 5.4269 4.2221 2.8030 2.8000 3.7845 3.9329 2.3147 8.1858 6.8861 4.3769 6.9358 6.6526 8.3636 6.1939 1.0874 1.0921 1.0888 1.0859 1.0895 1.0951 1.0956 1.1003 1.0927 1.0938 1.0652 1.0754
irintensity: 0.2083 0.2163 0.1451 1.8208 0.2796 0.9614 10.0872 5.0230 0.6891 0.2463 0.4701 0.4463 2.6183 1.8203 0.1809 0.6956 4.0033 0.4851 16.5770 7.8207 1.5822 35.9947 32.2934 4.7578 4.2551 76.2576 41.2897 4.1137 15.3406 12.1308 131.6347 16.1776 2.4928 4.8714 36.9174 83.7810 9.4269 6.4922 22.9183 25.2348 40.5906 11.9592 0.2036 3.0489 2.3949 17.5857 1.2126 3.6082 17.1827 10.1488 0.1224 62.8158 0.4709 6.2016 502.1981 1.5615 20.0313 9.3201 13.1414 1.3906 4.4775 8.3942 4.8156 43.9862 1.4690 3.1488 9.0967 1.9862 35.7108 226.9855 53.0824 33.5706 15.7890 56.2795 61.0373 111.4088 105.1999 79.3651 34.9788 48.3445 3.6293 81.0760 255.6951 109.6629 2.1926 2.6543 17.7490 2.6740 1.1808 11.8665 23.9558 41.5690 2.8895 7.6484 75.5798 14.3745
temp: 298.150 k
press: 1.00000 atm
elementType: 35 8 8 8 7 6 6 6 6 6 6 6 6 6 6 6 6 6 6 6 6 6 1 1 1 1 1 1 1 1 1 1 1 1
symmnumber: 1
zpe: 649965.8 jmol-1
zpe.correction: 0.247559 hartree
zpe.thermalcorrener: 0.266583 hartree
zpe.thermalcorrenthalpy: 0.267527 hartree
zpe.thermalcorrgfe: 0.196975 hartree
zpe.sumelectzpe: -947.401842 hartree
zpe.sumelectthermal: -947.382818 hartree
zpe.sumelectthermalent: -947.381874 hartree
zpe.sumelectthermalfe: -947.452426 hartree
dipole: 0.9507 -4.2692 0.3157
dipole: 4.3852
quadrupole: -113.9959 -130.1706 -139.2030
quadrupole: -6.5346 3.8033 5.2609
quadrupole: 13.7939 -2.3807 -11.4132 -6.5346 3.8033 5.2609
hfenergy: -947.6494011 hartree
pointgroup: C01 [X(C17H12Br1N1O3)]
dipole: -0.4893869 -1.6013346 -0.4156284 debye
polarizability: 505.6041553|13.8592011|230.9944296|2.4927881|3.1122118|100.765467 unknown
InChI: InChI=1S/C17H12BrNO3/c18-17-13-4-2-1-3-11(13)12-6-5-10(9-14(12)17)19-15(20)7-8-16(21)22/h1-9,17,19,21H
charge 0 multiplicity 1
34 atoms
Br -2.267796 2.904517 1.237553
O  2.649556 1.348331 -0.294595
O  7.715267 1.118858 -0.225726
O  7.201036 -1.120347 0.159001
N  2.03266 -0.894679 0.092799
C  -2.471416 1.50168 -0.276978
C  -1.490642 0.360456 -0.098361
C  -2.213501 -0.860838 0.059733
C  -3.82815 0.832774 -0.224324
C  -3.658627 -0.571773 -0.019546
C  -0.091004 0.405408 -0.098973
C  -1.508212 -2.07016 0.231155
C  -5.108152 1.393579 -0.359706
C  -4.781989 -1.421389 0.049368
C  0.61474 -0.820915 0.073634
C  -0.099518 -2.043357 0.239811
C  -6.236544 0.538055 -0.290053
C  -6.072551 -0.854728 -0.086109
C  2.963812 0.137071 -0.080847
C  4.378068 -0.333172 0.008715
C  5.418185 0.533376 -0.136604
C  6.81737 0.058135 -0.046857
H  -2.293023 2.129006 -1.163802
H  0.463594 1.339145 -0.208464
H  -2.03566 -3.021977 0.35229
H  -5.235006 2.473039 -0.495702
H  -4.666391 -2.500337 0.20076
H  0.457678 -2.979435 0.374562
H  -7.2438 0.956414 -0.390366
H  -6.956549 -1.499829 -0.032566
H  2.419579 -1.828705 0.251178
H  4.594552 -1.39487 0.195416
H  5.236626 1.596767 -0.322152
H  8.647705 0.776097 -0.160945
