program: Gaussian 09
title: 000241809
version: EM64L-G09RevD.01
frameworkgroup: C1[X(C17H10BrNO2)]
method: RPBEPBE
basis: SDD
operation: Freq
keyword: #p
keyword: freq=noraman
keyword: PBEPBE/SDD
title: #p freq=noraman PBEPBE/SDD
converged: YES YES NO YES
title: Mulliken charges:
elementType: Br O O N C C C C C C C C C C C C C C C C C H H H H H H H H H H
charge: 0.002746 -0.174402 -0.177757 -0.356256 0.304833 -0.692484 0.191429 0.269694 0.205555 -0.572491 0.529586 -0.400350 -0.378724 -0.367122 -0.386033 -0.217914 -0.189150 0.149400 0.152311 -0.253220 -0.252704 0.254783 0.251878 0.278616 0.243393 0.267801 0.262786 0.246796 0.249943 0.278632 0.278426
chargesum: 0.00000
title: Mulliken charges with hydrogens summed into heavy atoms:
elementType: Br O O N C C C C C C C C C C C C C C C C C
charge: 0.002746 -0.174402 -0.177757 -0.356256 0.304833 -0.185823 0.191429 0.269694 0.205555 -0.293875 0.529586 -0.156957 -0.110923 -0.104336 -0.139237 -0.217914 0.060793 0.149400 0.152311 0.025412 0.025722
polarizability: 3.95577626e+02 -3.86356571e+00 2.01174811e+02 -2.67801852e+00 -3.03644177e+00 9.29800918e+01
1716.lowfreq: -7.0758 -2.5441 -1.3703 0.0004 0.0007 0.0008 26.7532 35.3993 67.5488
frequency: 26.7515 35.3229 67.5470 72.5524 111.5107 138.1287 161.0428 162.7963 175.9241 236.6239 254.1013 275.0728 282.3303 289.9551 354.8124 389.3542 420.0639 421.6541 437.7149 506.6855 517.4610 519.1920 551.2754 563.8045 595.3385 612.2355 628.1645 660.9121 677.5735 683.9486 705.3095 733.8682 743.8013 756.9745 819.0204 826.4741 835.8024 840.1034 850.8040 865.3382 891.2392 942.1861 953.4539 956.9510 966.6217 972.3559 994.8103 1004.1409 1055.6756 1058.6388 1093.8505 1112.5326 1132.7284 1138.3324 1157.7299 1180.3112 1201.2775 1211.9241 1246.9243 1286.0319 1286.9691 1304.9368 1349.0035 1370.5664 1376.9563 1413.3245 1425.3036 1449.6406 1454.6815 1489.9303 1576.0808 1588.6627 1590.9591 1610.1194 1622.2518 1629.3496 1675.2354 2986.5504 3031.6045 3139.6381 3142.2660 3157.0275 3172.9061 3173.9052 3186.8928 3206.8829 3235.2410
redmass: 9.5429 5.5407 7.5926 7.1373 8.2667 5.1977 6.7998 14.3272 7.0199 2.1537 7.0171 6.6118 4.2829 10.1419 5.8989 5.2661 3.3334 5.4909 3.1009 3.9737 3.5155 7.3782 5.2256 4.4059 3.3161 9.2139 2.4399 6.9814 6.6586 7.4513 3.5452 7.0001 5.8867 3.0795 1.5400 1.6998 3.8694 1.7823 6.0261 1.4482 1.3988 1.3117 1.5967 1.4098 1.7824 3.5450 6.8212 4.2282 2.0372 1.2662 4.8265 2.3081 1.1472 1.8116 1.4942 2.0405 1.5953 2.6590 1.7705 1.5490 1.7191 1.8615 6.5078 7.1523 4.4125 3.1924 1.2226 4.7217 2.7429 3.6186 7.7657 7.3322 7.0025 7.7429 11.0287 7.4272 11.4850 1.0609 1.0994 1.0901 1.0903 1.0929 1.0958 1.0928 1.0948 1.0894 1.1110
irintensity: 0.1389 0.2993 1.2809 1.6502 6.9124 0.8131 1.8109 0.0493 0.5705 9.2328 2.2230 1.5611 0.0440 19.4205 0.5003 3.0009 10.0393 3.2987 0.3798 1.5508 3.5904 1.4349 2.1357 2.1976 0.3273 18.1351 5.9461 5.9830 2.6052 34.9301 19.4916 1.7118 7.3440 2.9307 10.7020 121.9039 29.2995 16.2263 4.8659 14.6956 2.2105 0.0929 4.1301 0.7708 10.2121 9.2846 23.8723 15.6405 45.4235 18.1380 53.8074 15.6098 0.0584 1.1520 16.6995 14.3050 1.8458 42.4558 42.8646 11.1481 1.6778 3.5628 398.7065 0.4881 27.7390 35.4792 28.4637 36.5804 154.1883 59.6535 13.0510 25.0808 16.3013 22.7556 375.3269 22.4846 11.4273 8.6490 5.1314 4.0631 12.1708 3.0280 6.9976 1.3886 2.9263 0.0234 0.9947
temp: 298.150 k
press: 1.00000 atm
elementType: 35 8 8 7 6 6 6 6 6 6 6 6 6 6 6 6 6 6 6 6 6 1 1 1 1 1 1 1 1 1 1
symmnumber: 1
zpe: 580260.3 jmol-1
zpe.correction: 0.221009 hartree
zpe.thermalcorrener: 0.237588 hartree
zpe.thermalcorrenthalpy: 0.238533 hartree
zpe.thermalcorrgfe: 0.174892 hartree
zpe.sumelectzpe: -871.071024 hartree
zpe.sumelectthermal: -871.054445 hartree
zpe.sumelectthermalent: -871.053501 hartree
zpe.sumelectthermalfe: -871.117142 hartree
dipole: -3.3825 -0.4232 0.0827
dipole: 3.4099
quadrupole: -113.0795 -127.2254 -134.1272
quadrupole: 6.3155 -0.2874 -9.8850
quadrupole: 11.7312 -2.4147 -9.3165 6.3155 -0.2874 -9.8850
hfenergy: -871.2920337 hartree
pointgroup: C01 [X(C17H10Br1N1O2)]
dipole: -1.3360872 0.1194101 -0.018993 debye
polarizability: 395.0894318|10.6634832|201.6519299|-0.4787752|-3.6402301|92.991167 unknown
InChI: InChI=1S/C17H10BrNO2/c18-12-1-3-14-10(8-12)7-11-9-13(2-4-15(11)14)19-16(20)5-6-17(19)21/h1-6,8-9H,7H2
charge 0 multiplicity 1
31 atoms
Br 7.08688 0.622866 -0.205524
O  -3.922507 -2.106605 -0.85015
O  -3.350425 2.268727 0.831366
N  -3.198583 0.017834 0.007396
C  0.481342 0.672554 -0.187031
C  1.619652 1.650245 -0.455042
C  1.007297 -0.607911 0.163035
C  2.859755 0.793629 -0.226415
C  2.478295 -0.534186 0.138027
C  -0.901387 0.892454 -0.252388
C  -1.774217 -0.184824 0.055135
C  0.132215 -1.675451 0.458608
C  -1.260321 -1.459721 0.411818
C  4.214579 1.152639 -0.332048
C  3.462634 -1.511964 0.400574
C  5.181503 0.15662 -0.065132
C  4.829067 -1.162859 0.298029
C  -4.163857 -0.948803 -0.435377
C  -3.880583 1.220306 0.393601
C  -5.512362 -0.292411 -0.307361
C  -5.347734 0.967539 0.173476
H  1.585501 2.519273 0.23065
H  1.583464 2.05793 -1.484099
H  -1.306586 1.872133 -0.516722
H  0.517192 -2.664444 0.728741
H  -1.948623 -2.277706 0.635483
H  4.518708 2.165953 -0.61066
H  3.187103 -2.534284 0.680573
H  5.608334 -1.90391 0.49648
H  -6.427069 -0.817079 -0.582884
H  -6.094369 1.730157 0.39444
