program: Gaussian 09
title: 000241806
version: EM64L-G09RevD.01
frameworkgroup: C1[X(C15H12BrNO)]
method: RPBEPBE
basis: SDD
operation: Freq
keyword: #p
keyword: freq=noraman
keyword: PBEPBE/SDD
title: #p freq=noraman PBEPBE/SDD
converged: NO NO NO NO
title: Mulliken charges:
elementType: Br O N C C C C C C C C C C C C C C C H H H H H H H H H H H H
charge: -0.026699 -0.254047 -0.449837 -0.822591 0.384530 0.197471 0.343798 0.201709 -0.525243 -0.387189 -0.384654 -0.397594 0.522463 -0.479197 -0.239455 -0.224951 0.212935 -0.799238 0.323744 0.330165 0.243092 0.254472 0.240266 0.220689 0.230392 0.228142 0.311261 0.237748 0.271477 0.236341
chargesum: 0.00000
title: Mulliken charges with hydrogens summed into heavy atoms:
elementType: Br O N C C C C C C C C C C C C C C C
charge: -0.026699 -0.254047 -0.138576 -0.498847 0.384530 0.197471 0.343798 0.201709 -0.195078 -0.144097 -0.130183 -0.157328 0.522463 -0.258508 -0.009062 0.003192 0.212935 -0.053672
polarizability: 3.20230313e+02 -1.13201733e+01 2.05968100e+02 7.69381175e+00 1.52423432e+01 9.64980075e+01
1716.lowfreq: -77.1276 -7.1768 -5.4515 -4.4408 -0.0005 -0.0003 0.0003 33.4830 57.5818
frequency: -77.1203 33.4633 57.5766 69.4022 76.6651 107.6201 116.5292 149.9331 186.5188 237.2216 243.6617 277.2553 345.7364 350.1516 413.4577 432.5717 445.6011 479.0098 517.0216 544.5266 564.7435 572.8399 594.8620 642.3523 642.8356 648.3858 662.2704 733.9936 746.2807 766.2467 775.5987 790.9193 829.9183 842.1416 882.6665 924.1713 934.0014 945.5277 952.1004 952.4803 988.0738 989.8536 1001.6185 1026.7943 1030.6099 1096.8644 1122.3458 1128.3574 1146.8040 1168.6042 1178.5477 1201.7806 1218.7990 1234.9316 1274.1501 1290.5836 1308.7631 1368.6453 1374.8387 1387.9135 1440.5347 1447.9247 1456.6415 1462.7709 1467.9533 1492.2743 1514.0884 1593.8394 1598.0896 1619.8180 1628.5491 1629.9109 2989.0921 3074.3854 3082.2252 3114.2795 3128.1644 3138.0975 3140.6800 3148.8874 3150.4448 3166.9331 3185.5174 3519.8566
redmass: 1.0524 6.5982 5.2981 6.4710 7.5411 4.6710 5.0534 4.0532 6.5785 5.7696 6.0756 4.0128 5.1593 4.8599 3.5199 4.6061 3.1073 4.3321 4.7031 5.0350 4.2509 3.5342 3.3695 1.5062 3.2131 6.0513 3.5304 4.8868 1.9277 3.6345 2.6702 3.1595 1.6059 4.3768 1.5089 3.8039 2.8641 1.4439 1.5349 1.4179 1.4303 2.5761 2.5521 2.0776 1.6644 2.1157 1.3381 1.6066 1.3612 1.2559 1.3995 2.1011 1.9510 2.4431 1.8516 1.6108 2.2555 4.5693 1.2969 4.2458 1.8676 1.7299 2.0060 4.0136 1.0473 3.9782 2.0935 6.9821 6.3684 7.1337 6.2226 5.4324 1.0383 1.0984 1.0873 1.0886 1.0857 1.0894 1.0979 1.0953 1.0955 1.1003 1.0937 1.0764
irintensity: 0.0266 0.3285 10.2082 1.7497 0.5824 0.8302 4.3825 0.5325 2.2044 1.8057 2.3577 1.0976 1.2393 1.0416 3.8512 6.5695 1.2958 32.3723 0.7893 5.2835 2.2662 2.4867 19.3523 34.9619 15.3988 27.5239 19.3145 3.4887 82.8228 7.4641 17.0014 17.3549 41.2222 15.1404 0.2049 1.8564 10.6535 3.3893 15.1531 3.4542 1.5844 18.0819 8.2709 6.8807 7.7202 4.4838 25.8758 4.6283 10.6767 2.1040 2.6142 5.8332 12.4077 97.9474 16.2569 24.3983 23.7070 71.9308 81.5125 43.9412 62.9252 76.8241 15.7100 148.4466 19.8665 214.7141 161.2046 13.0555 61.4144 18.9711 39.1992 93.9598 9.6016 15.0358 2.4497 24.0695 2.5483 1.8064 6.3044 3.5698 35.5225 35.4832 8.5971 13.4275
temp: 298.150 k
press: 1.00000 atm
elementType: 35 8 7 6 6 6 6 6 6 6 6 6 6 6 6 6 6 6 1 1 1 1 1 1 1 1 1 1 1 1
symmnumber: 1
zpe: 599437.3 jmol-1
zpe.correction: 0.228314 hartree
zpe.thermalcorrener: 0.243128 hartree
zpe.thermalcorrenthalpy: 0.244072 hartree
zpe.thermalcorrgfe: 0.184517 hartree
zpe.sumelectzpe: -721.024756 hartree
zpe.sumelectthermal: -721.009941 hartree
zpe.sumelectthermalent: -721.008997 hartree
zpe.sumelectthermalfe: -721.068552 hartree
dipole: -1.5445 -5.4416 -0.3311
dipole: 5.6662
quadrupole: -84.9964 -109.2999 -116.9739
quadrupole: 12.0304 8.0909 5.1484
quadrupole: 18.7603 -5.5432 -13.2171 12.0304 8.0909 5.1484
hfenergy: -721.2530693 hartree
pointgroup: C01 [X(C15H12Br1N1O1)]
dipole: 0.4260873 -2.1714344 -0.2699245 debye
polarizability: 321.4399854|0.6599343|206.9773362|3.9041605|4.3778314|94.2790987 unknown
InChI: InChI=1S/C15H12BrNO/c1-9(18)17-10-6-7-12-11-4-2-3-5-13(11)15(16)14(12)8-10/h2-8,15,17H,1H3
charge 0 multiplicity 1
30 atoms
Br -0.871224 2.942781 1.155325
O  4.093984 1.518467 -0.409117
N  3.564335 -0.723341 0.052295
C  -1.037375 1.485382 -0.313267
C  -0.011572 0.387689 -0.120097
C  -0.684811 -0.855051 0.075018
C  -2.366986 0.767926 -0.227323
C  -2.141135 -0.623172 0.007456
C  1.385795 0.487566 -0.140546
C  0.06985 -2.03076 0.26349
C  -3.668491 1.277528 -0.3592
C  -3.231175 -1.511888 0.109459
C  2.141675 -0.704575 0.049373
C  1.476501 -1.948243 0.252006
C  -4.762698 0.383058 -0.256352
C  -4.543109 -0.997364 -0.02332
C  4.457906 0.331266 -0.162384
C  5.928562 -0.079776 -0.077897
H  -0.893946 2.096282 -1.217886
H  1.902473 1.43937 -0.276707
H  -0.41774 -2.999759 0.411949
H  -3.836083 2.348447 -0.516085
H  -3.072912 -2.581812 0.283529
H  2.072033 -2.858607 0.399067
H  -5.786275 0.760392 -0.352559
H  -5.401556 -1.6736 0.055495
H  3.988044 -1.63718 0.231996
H  6.174113 -0.488464 0.919778
H  6.548404 0.809309 -0.258597
H  6.175515 -0.84667 -0.835296
