program: Gaussian 09
title: 000241807
version: EM64L-G09RevD.01
frameworkgroup: C1[X(C19H16N2O4)]
method: RPBEPBE
basis: SDD
operation: Freq
keyword: #p
keyword: freq=noraman
keyword: PBEPBE/SDD
title: #p freq=noraman PBEPBE/SDD
converged: YES YES NO NO
title: Mulliken charges:
elementType: O O O O N N C C C C C C C C C C C C C C C C C C C H H H H H H H H H H H H H H H H
charge: -0.257824 -0.262317 -0.418143 -0.249494 -0.450344 -0.480883 -0.699489 0.307829 0.311995 0.201082 0.201308 -0.573910 -0.568129 -0.387566 -0.387181 0.522467 0.517571 -0.485604 -0.488604 0.211137 0.230755 -0.800201 -0.301436 -0.214169 0.168401 0.254199 0.254197 0.321554 0.322369 0.238681 0.240146 0.218114 0.222406 0.310312 0.310888 0.236714 0.270216 0.236772 0.244224 0.290598 0.381358
chargesum: 0.00000
title: Mulliken charges with hydrogens summed into heavy atoms:
elementType: O O O O N N C C C C C C C C C C C C C C C C C C C
charge: -0.257824 -0.262317 -0.036785 -0.249494 -0.140033 -0.169994 -0.191093 0.307829 0.311995 0.201082 0.201308 -0.252356 -0.245760 -0.148885 -0.147034 0.522467 0.517571 -0.267490 -0.266198 0.211137 0.230755 -0.056500 -0.057212 0.076429 0.168401
polarizability: 6.68245034e+02 2.25800360e+01 2.42748429e+02 1.09900041e-03 5.52535629e-04 9.84424459e+01
1716.lowfreq: -86.5746 -2.3312 -0.0011 0.0010 0.0013 4.6291 5.8111 19.1649 34.1444
frequency: -86.5727 19.1576 34.1424 38.6160 44.8639 55.0071 70.3872 86.8904 103.2321 135.9409 140.9249 154.5856 161.4300 178.4273 228.5253 232.0781 239.7282 270.1919 292.0919 301.8228 323.5932 368.9270 402.2400 418.6760 425.3710 443.4706 484.4328 508.7375 538.7950 551.2708 557.1767 570.4025 579.8671 580.6558 612.0686 628.1409 643.7094 645.1003 649.4580 651.9349 715.3344 715.7940 728.3481 743.4041 758.9000 766.4646 791.8635 819.4798 829.5378 898.2153 906.8602 916.3082 921.1132 932.1014 942.2981 944.3789 945.3533 945.8880 968.8408 983.3128 987.9457 992.8234 1000.6733 1029.6122 1057.3142 1110.6580 1133.8233 1135.0345 1142.7749 1151.5917 1172.2574 1204.5336 1217.6034 1219.4916 1229.3282 1258.3947 1278.3387 1288.8048 1306.6246 1320.9367 1328.5211 1366.8593 1373.8185 1376.5678 1423.8909 1433.8278 1449.2622 1455.6128 1467.6120 1468.8863 1486.4040 1511.5110 1513.5296 1586.2978 1593.9684 1595.6285 1623.0462 1629.1570 1630.0326 1631.9243 1656.7687 2986.7476 2989.4182 3033.9311 3071.7680 3107.4832 3109.1724 3111.3137 3137.6978 3144.2656 3147.0534 3170.2684 3183.2110 3185.0028 3519.9420 3520.0615 3522.6246
redmass: 1.0455 6.5635 7.2793 7.2917 5.3539 7.1207 5.1599 6.7200 4.9638 6.8593 4.2103 4.5972 7.3827 3.1707 3.9766 6.2836 2.1492 8.0416 4.6456 4.2202 8.7947 5.7343 4.1371 5.1847 2.7169 3.2493 4.5245 4.0956 2.7682 4.5877 6.1478 1.8640 5.8763 2.4250 2.4862 5.7898 1.2062 1.2756 6.3393 1.9681 6.1943 3.1804 8.2295 5.6457 5.3756 3.5456 5.2626 1.4740 1.6770 1.6567 2.1666 5.4398 3.9137 4.0819 1.3648 1.3879 1.3677 3.2614 4.2180 1.8139 2.8923 1.0875 2.5486 1.6597 2.1943 2.5855 1.7814 1.1528 1.7612 1.4338 1.7225 1.6554 1.7122 1.4704 2.5154 2.3260 1.6341 1.4380 1.7414 2.9730 2.6018 3.5854 1.3759 4.3748 1.1345 2.8999 1.4338 3.7312 1.0469 2.8360 2.9958 2.4289 2.1541 8.3983 4.6579 5.8776 6.1509 7.2955 7.6478 5.0203 6.1884 1.0384 1.0613 1.0991 1.0984 1.0919 1.0884 1.0886 1.0978 1.0957 1.0955 1.0925 1.0934 1.0934 1.0764 1.0764 1.0641
irintensity: 0.0156 1.8566 0.7090 0.2091 0.4480 0.6621 14.3191 0.6440 4.6147 9.4483 0.6892 0.2493 4.0913 0.6365 0.5257 0.5861 9.7218 0.4088 1.3543 0.6664 9.1402 0.8409 0.1113 9.7081 15.4717 0.0578 51.6498 3.9620 31.3233 6.3188 1.6517 48.4508 42.8954 11.0943 4.0381 11.3143 54.9014 92.5857 3.6947 33.3377 7.6260 18.2243 34.6696 0.2815 5.1321 0.0231 12.0716 124.1611 0.0512 17.0800 1.1345 2.8532 0.0445 19.5665 0.1485 0.0456 2.6426 21.2680 23.3893 41.6456 24.6015 62.7824 26.3680 7.7781 600.7615 11.5790 0.7633 0.0008 13.1829 21.0797 3.4799 3.6279 8.0193 27.6890 134.2435 51.1903 12.1463 3.5323 61.2569 29.6829 254.9368 89.9287 23.5819 97.5322 7.7336 265.2802 54.8212 17.9980 19.9156 195.1684 111.4888 122.9343 301.8881 130.7701 109.5684 135.5200 258.4772 14.4748 264.8323 95.9207 175.1856 11.2996 6.4918 4.6925 15.5776 2.8070 38.6957 13.2803 7.2908 6.7957 30.0730 4.1790 4.9565 5.4730 16.3882 17.7140 78.7667
temp: 298.150 k
press: 1.00000 atm
elementType: 8 8 8 8 7 7 6 6 6 6 6 6 6 6 6 6 6 6 6 6 6 6 6 6 6 1 1 1 1 1 1 1 1 1 1 1 1 1 1 1 1
symmnumber: 1
zpe: 815419.7 jmol-1
zpe.correction: 0.310577 hartree
zpe.thermalcorrener: 0.332147 hartree
zpe.thermalcorrenthalpy: 0.333091 hartree
zpe.thermalcorrgfe: 0.257689 hartree
zpe.sumelectzpe: -1142.322018 hartree
zpe.sumelectthermal: -1142.300448 hartree
zpe.sumelectthermalent: -1142.299503 hartree
zpe.sumelectthermalfe: -1142.374906 hartree
dipole: 3.4568 5.1830 0.0002
dipole: 6.2300
quadrupole: -104.4935 -143.8923 -149.3898
quadrupole: 18.2162 0.0015 0.0003
quadrupole: 28.0983 -11.3004 -16.7979 18.2162 0.0015 0.0003
hfenergy: -1142.6325949 hartree
pointgroup: C01 [X(C19H16N2O4)]
dipole: -1.3735058 -2.0300636 -0.0016094 debye
polarizability: 668.5259024|19.7552683|242.4674566|0.002413|0.1222308|98.44255 unknown
InChI: InChI=1S/C19H16N2O4/c1-11(22)20-14-2-4-16-12(9-14)8-13-10-15(3-5-17(13)16)21-18(23)6-7-19(24)25/h2-7,9-10,20-21,24H,8H2,1H3
charge 0 multiplicity 1
41 atoms
O  -6.346446 2.490375 0.002436
O  3.743809 1.510783 0.001441
O  8.810624 1.769379 0.001697
O  8.522558 -0.542553 -0.000531
N  -6.407279 0.140521 0.000455
N  3.355841 -0.816802 -0.000617
C  -1.377466 1.150386 0.001141
C  -2.657272 0.322247 0.000504
C  -0.282137 0.090503 0.000244
C  -2.333129 -1.06928 -0.000635
C  -0.870306 -1.212544 -0.000799
C  -3.986391 0.769943 0.000902
C  1.107613 0.271552 0.000349
C  -3.368486 -2.031153 -0.001383
C  -0.041301 -2.358067 -0.001767
C  -5.025386 -0.204281 0.00014
C  1.93708 -0.887632 -0.000624
C  -4.706557 -1.593937 -0.000991
C  1.355604 -2.189868 -0.001674
C  -7.001409 1.407415 0.001535
C  4.17738 0.316065 0.000358
C  -8.530994 1.366236 0.001716
C  5.631332 -0.021311 0.000013
C  6.582252 0.954028 0.000903
C  8.020451 0.609672 0.000529
H  -1.31293 1.810305 0.887971
H  -1.312987 1.811753 -0.884615
H  -4.246564 1.829926 0.001765
H  1.569296 1.260754 0.001146
H  -3.146437 -3.103781 -0.002255
H  -0.468124 -3.366661 -0.002585
H  -5.518562 -2.333073 -0.001565
H  2.00879 -3.07241 -0.002418
H  -7.052647 -0.653431 -0.00018
H  3.83721 -1.719958 -0.001442
H  -8.919393 0.84656 -0.893923
H  -8.907688 2.398697 0.001985
H  -8.919101 0.846234 0.897295
H  5.951486 -1.073289 -0.000994
H  6.296787 2.010746 0.001899
H  9.771681 1.509452 0.001474
