program: Gaussian 09
title: 000241796
version: EM64L-G09RevD.01
frameworkgroup: C1[X(C11H9NO3)]
method: RPBEPBE
basis: SDD
operation: Freq
keyword: #p
keyword: freq=noraman
keyword: PBEPBE/SDD
title: #p freq=noraman PBEPBE/SDD
converged: YES YES NO NO
title: Mulliken charges:
elementType: O O O N C C C C C C C C C C C H H H H H H H H H
charge: -0.218609 -0.257264 -0.167409 0.037025 0.212022 0.326632 -0.357017 -0.313328 -0.324559 -0.350817 0.064076 -0.240300 -0.298096 0.139300 -0.537209 0.263688 0.254664 0.249152 0.257262 0.281013 0.275583 0.227585 0.225992 0.250614
chargesum: 0.00000
title: Mulliken charges with hydrogens summed into heavy atoms:
elementType: O O O N C C C C C C C C C C C
charge: -0.218609 -0.257264 -0.167409 0.037025 0.212022 0.326632 -0.093329 -0.058665 -0.075406 -0.093555 0.064076 0.040713 -0.022513 0.139300 0.166983
polarizability: 3.59467543e+02 -1.30223838e+01 1.14070999e+02 -2.66436406e+00 -2.07117970e+00 6.57494743e+01
1716.lowfreq: -5.8914 -3.1079 -0.0008 -0.0008 -0.0007 9.0207 37.7758 51.7515 87.7428
frequency: 37.7255 51.7400 87.7364 99.7512 155.0429 187.5155 217.0555 236.6521 266.1116 290.4309 340.9518 403.5443 417.6061 426.7162 490.0033 529.9866 551.5525 596.2300 615.8663 657.4980 680.3071 703.7177 726.4339 729.3737 786.1621 808.2137 817.2743 831.6363 840.8264 880.6650 937.0778 949.3422 959.1153 982.3683 994.8129 1038.7653 1061.7962 1111.3651 1112.1079 1157.3591 1166.6095 1185.0723 1225.6160 1246.2964 1297.2999 1312.0176 1355.9523 1433.8937 1437.4435 1469.2687 1470.6448 1488.1022 1550.6608 1557.2556 1595.1185 1636.3886 1700.7709 2968.5109 3060.1024 3133.1504 3142.0974 3156.4909 3170.2458 3177.1391 3209.4178 3235.5738
redmass: 4.8419 6.5267 4.7305 4.1418 6.0365 3.5315 2.1666 2.2182 4.3313 4.3660 5.0880 6.1832 4.0478 4.5308 4.8359 2.5410 5.8255 3.6918 6.7944 6.8834 7.1861 5.9979 4.2797 6.2910 6.2678 1.3862 1.4639 2.2275 3.7858 7.1369 1.3389 1.3411 1.3400 8.2756 2.5675 2.5581 1.4933 1.3309 1.2595 1.3250 1.3675 2.7432 2.7895 4.2229 1.3195 1.9147 5.0708 3.2825 1.2792 1.0495 1.0975 2.3597 6.3594 6.7630 7.8201 8.7368 12.1395 1.0327 1.1043 1.1000 1.0886 1.0878 1.0959 1.0970 1.0897 1.1082
irintensity: 1.5761 3.1673 7.0677 6.9629 1.9462 3.7915 1.6326 0.8161 2.9349 3.7558 2.6508 6.0834 15.5125 1.0989 5.3377 20.6790 42.2847 4.8344 3.1371 2.4676 9.3438 0.5323 26.1162 36.3530 46.2177 31.9977 54.5220 46.3295 96.6452 11.0266 0.5294 0.3857 1.3773 65.3857 8.8695 43.5060 38.1164 16.0980 0.1438 9.0314 247.4041 79.2200 98.3339 231.4959 2.4539 15.0534 24.0970 1.7970 22.9297 15.1828 77.8922 46.5497 130.3934 56.5282 124.1131 138.0785 652.9501 93.2404 42.7279 23.5248 4.5850 7.0565 5.7574 9.6028 0.6253 0.2810
temp: 298.150 k
press: 1.00000 atm
elementType: 8 8 8 7 6 6 6 6 6 6 6 6 6 6 6 1 1 1 1 1 1 1 1 1
symmnumber: 1
zpe: 461456.9 jmol-1
zpe.correction: 0.175760 hartree
zpe.thermalcorrener: 0.188596 hartree
zpe.thermalcorrenthalpy: 0.189541 hartree
zpe.thermalcorrgfe: 0.135555 hartree
zpe.sumelectzpe: -703.888871 hartree
zpe.sumelectthermal: -703.876035 hartree
zpe.sumelectthermalent: -703.875090 hartree
zpe.sumelectthermalfe: -703.929076 hartree
dipole: 6.9855 2.7533 2.0712
dipole: 7.7889
quadrupole: -93.3683 -83.0495 -87.3057
quadrupole: -19.5392 -1.4991 -2.2719
quadrupole: -5.4605 4.8584 0.6021 -19.5392 -1.4991 -2.2719
hfenergy: -704.0646311 hartree
pointgroup: C01 [X(C11H9N1O3)]
dipole: -2.7400133 1.0927698 0.8298659 debye
dipolederiv: -1.3199882 0.0256969 -0.0942201 -0.1547878 -0.318288 -0.1318772 -0.2172856 -0.1443296 -0.4516395 -2.4126594 0.1824981 -0.0939941 0.3194117 -0.3199781 0.0173563 0.2925999 -0.0111828 -0.2983957 -1.8496429 0.0418679 -0.0674422 0.3212219 -0.3479505 -0.0250703 0.3134548 -0.0459241 -0.35004 0.5152025 0.1553814 0.1565985 -0.3655368 -0.2346003 -0.0830499 0.2123926 -0.031926 -0.3070142 -0.3046575 -0.0955177 -0.191392 0.27359 0.0119839 0.0592584 0.1509759 0.026694 -0.0246122 1.9524077 -0.1627778 -0.1091822 -0.2792689 0.1294824 0.0121351 -0.5935014 0.0588211 0.07099 0.5121077 -0.0358108 0.1175911 0.1321706 -0.106845 -0.0356406 0.1692941 0.023119 0.1622622 0.2914409 -0.0282641 -0.0610178 -0.2674932 -0.0951803 -0.0371037 -0.3751317 -0.0777714 -0.0042951 -0.4912155 -0.0116532 -0.0243661 -0.0563849 -0.1932256 -0.0194001 0.6924622 -0.0477702 -0.0423464 -0.7823881 -0.0118839 0.0250747 0.1263669 -0.1599783 -0.0419954 -0.4029919 -0.0208067 0.0573806 0.6262902 -0.0862963 -0.0081415 -0.4406482 0.2362317 0.0816929 -1.1605267 0.0871662 0.2579069 0.6935261 0.0016825 0.0620476 0.4881664 -0.0478751 0.0140478 0.6031954 0.0207493 -0.0377257 -1.0021494 0.0325663 0.0143439 0.34271 -0.1203995 0.0634284 0.4321198 0.0387242 -0.0642269 2.4204081 -0.0698167 0.104695 -0.4351585 0.4116813 0.1795233 -0.4566797 0.1855756 0.5441185 0.9765157 -0.0605755 0.1332957 -0.1658306 0.3352366 -0.0208291 0.6030025 -0.0521399 0.3195851 0.0865505 0.0126318 0.0565536 0.001 0.1536229 0.0105189 0.0298508 0.0114181 -0.0226904 0.0138417 0.0523019 -0.0864177 0.0631851 0.1321192 0.03391 -0.0478929 0.0300844 0.0163617 -0.0339793 0.0335862 -0.0924963 0.0195401 0.157725 0.0322201 -0.1041529 0.0299664 0.0201552 0.064092 0.0030835 0.0500048 0.0488 0.1607921 0.0349982 0.0732462 0.02509 -0.0211578 0.0748375 0.0574091 0.0661748 0.0265099 0.1252571 -0.0457752 0.0564301 -0.0493713 0.097768 0.0692915 -0.0255491 -0.0423557 -0.0379232 0.1251615 -0.0828136 0.0122366 -0.0734254 0.0745605 0.0241572 0.0330421 0.003533 -0.0282785 -0.0620792 -0.1118281 -0.219696 -0.0919616 -0.0450946 0.013471 -0.0716432 0.0248156 0.0388708 -0.0959843 0.0970265 -0.1765144 0.1175234 -0.0021834 -0.13746 0.0280406 0.0562975 0.0297673 0.1230905 -0.0007328 0.1131123 -0.0083228 0.0503331 unknown
polarizability: 358.389698|-5.460961|66.603273|20.4771365|6.0515802|114.2950449 unknown
InChI: InChI=1S/C11H9NO3/c1-14-9-4-2-8(3-5-9)12-10-6-7-11(13)15-10/h2-7H,1H3
charge 0 multiplicity 1
24 atoms
O  3.230728 -0.457163 -0.807486
O  -4.47935 0.373147 0.568519
O  5.465155 -0.182593 -0.109195
N  0.902278 -0.344615 -0.969081
C  -0.422859 -0.14576 -0.541819
C  -3.16389 0.212512 0.126912
C  -1.395741 0.094127 -1.551748
C  -0.86303 -0.251353 0.816971
C  -2.749824 0.296864 -1.228553
C  -2.215558 -0.083127 1.142776
C  1.96268 -0.04574 -0.283048
C  2.214786 0.736645 0.945773
C  3.565226 0.794456 1.16392
C  4.261745 0.039712 0.091757
C  -5.512376 0.64017 -0.439067
H  -1.056701 0.133086 -2.591246
H  -0.152761 -0.531319 1.60253
H  -3.467244 0.500643 -2.028313
H  -2.569956 -0.189477 2.17229
H  1.428045 1.217921 1.525696
H  4.106617 1.310187 1.95598
H  -5.58869 -0.19295 -1.163336
H  -5.312159 1.587005 -0.975848
H  -6.449423 0.726123 0.129318
