program: Gaussian 09
title: 000241893
version: EM64L-G09RevD.01
frameworkgroup: C1[X(C17H18N6O6S)]
method: RPBEPBE
basis: SDD
operation: Freq
keyword: #p
keyword: freq=noraman
keyword: PBEPBE/SDD
title: #p freq=noraman PBEPBE/SDD
converged: YES YES NO NO
title: Mulliken charges:
elementType: S O O O O O O N N N N N N C C C C C C C C C C C C C C C C C H H H H H H H H H H H H H H H H H H
charge: 0.297299 -0.277809 -0.452366 -0.460323 -0.435212 -0.209009 -0.208224 -0.187644 -0.041868 -0.250278 -0.083888 -0.593451 0.026312 -0.198782 -0.069920 -0.171689 -0.104683 -0.341582 0.290199 -0.210483 0.067185 -0.316404 0.046025 -0.885429 0.572034 -0.392425 -0.319719 -0.350081 -0.351596 0.378589 0.273973 0.246785 0.238063 0.278238 0.223657 0.217689 0.353617 0.397103 0.277667 0.351396 0.315580 0.284707 0.351771 0.337204 0.245988 0.268295 0.287367 0.286122
chargesum: 0.00000
title: Mulliken charges with hydrogens summed into heavy atoms:
elementType: S O O O O O O N N N N N N C C C C C C C C C C C C C C C C C
charge: 0.297299 -0.277809 -0.098749 -0.063220 -0.083817 -0.209009 -0.208224 -0.187644 -0.041868 -0.250278 -0.083888 0.095524 0.026312 0.075191 0.176865 0.066374 0.173556 0.099764 0.290199 0.067184 0.067185 -0.316404 0.046025 -0.285142 0.572034 -0.146438 -0.051424 -0.062714 -0.065474 0.378589
polarizability: 4.24157731e+02 3.23971197e+00 2.40070006e+02 2.60169061e+00 2.15760180e+01 2.08067236e+02
1716.lowfreq: -10.9047 -3.2037 -0.0016 -0.0012 -0.0010 4.2618 8.6999 13.3930 20.0351
frequency: 8.5282 10.5250 19.8493 32.4458 34.5955 66.3451 66.9153 73.2336 90.3314 94.5871 102.6183 126.8643 138.5582 141.5971 159.3015 183.7961 194.5662 231.8214 233.8729 257.4049 265.9993 291.1890 307.6596 314.2173 324.4631 333.9724 353.4988 357.7377 376.0831 406.4238 408.7024 419.5229 430.6444 458.5186 467.5081 486.6464 500.1877 506.1232 513.3893 516.8266 535.3598 558.4350 588.4873 607.0553 624.5423 640.0587 643.2738 647.4950 673.3065 687.4798 710.7175 733.6967 746.7818 761.7602 778.0014 783.8619 810.2141 820.3405 821.0035 834.9727 852.1125 866.0301 882.7300 896.9102 914.9518 927.0251 932.6587 954.6977 971.3299 980.5626 988.9874 1000.3635 1001.5180 1006.8061 1009.4764 1039.4630 1048.6069 1065.8468 1086.3005 1092.4331 1106.0920 1112.9439 1160.1782 1170.4275 1176.3194 1178.9550 1181.0213 1199.9526 1211.3981 1219.4754 1223.7765 1228.0064 1251.9204 1259.5227 1272.7955 1292.2893 1301.9749 1302.5264 1313.9301 1320.5854 1333.1689 1341.5489 1349.3834 1365.7918 1379.8201 1385.3993 1401.7685 1404.1791 1422.2186 1441.0455 1448.4011 1468.2858 1481.0857 1503.7181 1529.5292 1558.3683 1596.2731 1597.4970 1608.8088 1624.4179 2719.0259 2973.1696 3020.3065 3024.9383 3031.4889 3035.9301 3063.5522 3079.3344 3114.0638 3141.0489 3149.4960 3182.5022 3184.8388 3233.4338 3533.3814 3551.1951 3578.0952 3706.4818
redmass: 8.4107 7.1971 5.9350 7.6540 6.9508 7.0104 6.9203 8.1356 6.1908 4.7987 5.2546 6.2091 7.4578 6.5263 5.9286 7.1403 6.4632 5.7074 6.1705 6.0042 4.7822 6.7449 6.0956 1.2973 5.3915 3.5958 3.7790 3.0153 6.4093 4.1914 2.9179 6.6146 6.3881 1.2789 4.2215 4.1683 1.1229 6.6973 1.4603 3.2835 3.7445 5.6414 7.3560 5.7239 6.9803 6.8293 4.7262 5.9742 4.2658 6.1555 11.3847 4.2422 4.7246 6.9592 5.5971 5.0516 4.1928 3.9965 2.0285 8.2956 1.2889 1.5741 6.8220 1.9024 1.9858 2.1918 2.2826 2.7665 5.5010 3.9678 1.3546 1.3899 2.9750 3.0184 4.3877 2.7015 2.1751 2.8715 2.9237 3.2600 1.3226 4.1003 1.3625 2.1495 1.4053 1.0998 1.3043 1.6872 2.0556 3.7236 4.4775 1.2929 1.1865 1.2773 1.1837 3.1628 1.3701 1.2967 1.3078 7.7579 1.5378 3.0207 1.3902 7.8126 1.2977 2.9214 2.0490 8.5732 3.2979 3.4986 1.1615 1.0860 2.4655 2.6080 9.5985 2.0634 6.8551 2.5174 5.9374 1.4287 1.0791 1.0654 1.0869 1.0606 1.0852 1.0875 1.0921 1.0933 1.1045 1.0907 1.0909 1.0945 1.0956 1.0988 1.0653 1.0456 1.0664 1.1054
irintensity: 0.1256 0.2906 0.0700 0.6805 1.4770 1.4195 0.0276 2.4395 0.4063 2.9329 3.4691 1.0753 4.1286 3.4391 4.6858 0.7639 0.3058 2.9999 4.9126 2.8531 12.5044 0.7349 4.1398 138.5990 2.7077 10.8659 11.9923 16.4810 3.4669 7.1730 0.1199 2.3333 2.8330 144.8691 19.8393 14.3202 119.7163 3.4106 112.9207 31.1929 26.6299 6.8857 1.7693 4.6955 0.4499 17.4748 9.9201 3.6409 34.9937 16.4435 5.8040 32.1118 10.8890 38.8684 4.7350 10.9652 115.5315 4.5447 20.5524 18.4220 5.4455 31.2212 174.0378 27.1013 9.1385 80.5363 92.1640 16.9905 14.9338 173.2569 2.3875 2.8557 113.8606 4.5289 34.5639 30.1370 8.8425 23.5016 9.9048 20.5727 13.6448 107.9256 3.4234 79.5222 23.6250 15.9143 57.0202 73.3231 20.6681 259.9697 112.5680 8.9468 3.7663 1.4981 17.3345 7.6914 8.4109 1.2744 12.9846 67.3056 28.7329 16.8909 1.4219 94.8690 38.3240 122.3665 8.8436 0.4003 44.4965 28.8341 33.1911 4.4116 10.8654 103.2182 535.8380 29.7195 16.0295 250.5824 70.7524 362.0911 2109.3567 30.7643 35.8326 32.4302 6.8958 21.3417 10.7841 25.8458 10.8460 9.0761 1.2616 0.0250 2.9811 0.7535 7.2890 134.2023 15.3132 61.8279
temp: 298.150 k
press: 1.00000 atm
elementType: 16 8 8 8 8 8 8 7 7 7 7 7 7 6 6 6 6 6 6 6 6 6 6 6 6 6 6 6 6 6 1 1 1 1 1 1 1 1 1 1 1 1 1 1 1 1 1 1
symmnumber: 1
zpe: 926387.0 jmol-1
zpe.correction: 0.352842 hartree
zpe.thermalcorrener: 0.380003 hartree
zpe.thermalcorrenthalpy: 0.380947 hartree
zpe.thermalcorrgfe: 0.290963 hartree
zpe.sumelectzpe: -1834.245233 hartree
zpe.sumelectthermal: -1834.218072 hartree
zpe.sumelectthermalent: -1834.217128 hartree
zpe.sumelectthermalfe: -1834.307113 hartree
dipole: 4.2239 -5.4541 5.0790
dipole: 8.5665
quadrupole: -212.1630 -199.7367 -177.0986
quadrupole: 9.7030 -4.8705 4.1045
quadrupole: -15.8302 -3.4039 19.2342 9.7030 -4.8705 4.1045
hfenergy: -1834.5980753 hartree
pointgroup: C01[X(C17H18N6O6S1)]
dipole: 1.7478102 -1.6573528 -2.3573924 debye
polarizability: 423.7721911|9.9391607|213.3381748|2.8573242|-24.2816065|235.1846063 unknown
InChI: InChI=1S/C17H18N6O6S/c18-17-20-14-11(19-7-22(14)16-13(26)12(25)10(5-24)29-16)15(21-17)30-6-8-1-3-9(4-2-8)23(27)28/h1-4,7,10,12-13,16,24-26H,5-6,18H2
charge 0 multiplicity 1
48 atoms
S  -1.849373 0.743413 -2.165474
O  4.201586 1.167212 1.271215
O  6.477636 0.686252 -1.01321
O  4.342892 -1.96512 0.537661
O  6.045459 1.692112 3.38642
O  -8.173294 0.169451 1.880955
O  -6.559235 -0.222952 3.444609
N  2.955973 1.289827 -0.766494
N  1.08861 2.220502 -1.745382
N  2.019363 -0.935519 -0.194539
N  -0.323555 -1.16195 -0.860877
N  0.821641 -2.913604 0.200752
N  -6.955106 -0.092994 2.221871
C  5.19818 0.056397 -0.653712
C  4.307418 1.245258 -0.192605
C  5.307336 -0.888732 0.589353
C  5.097516 0.070719 1.78581
C  6.373892 0.721943 2.339079
C  1.956776 0.320043 -0.705245
C  2.363891 2.415662 -1.393617
C  0.808976 0.907224 -1.319031
C  -0.350241 0.091126 -1.379347
C  0.842711 -1.636169 -0.298287
C  -3.020278 -0.762044 -1.991475
C  -4.043785 -0.575622 -0.899002
C  -5.397407 -0.287612 -1.215552
C  -3.663956 -0.699237 0.466018
C  -6.360044 -0.125961 -0.199915
C  -4.610166 -0.54219 1.493718
C  -5.949825 -0.257264 1.143848
H  4.766857 -0.493382 -1.511755
H  4.806633 2.186622 -0.486726
H  6.302391 -1.368428 0.627541
H  4.529914 -0.416234 2.596075
H  6.947923 1.195176 1.515556
H  7.004264 -0.039748 2.830291
H  7.106899 -0.007858 -1.333179
H  3.409332 -1.574887 0.313484
H  2.927036 3.332276 -1.557502
H  5.335898 2.28377 3.022358
H  -2.342024 -1.606762 -1.782393
H  -3.478592 -0.872253 -2.985827
H  1.657527 -3.308513 0.627106
H  -0.030325 -3.461597 0.122061
H  -5.698638 -0.188493 -2.264483
H  -2.618229 -0.916278 0.708588
H  -7.406762 0.095805 -0.423583
H  -4.340099 -0.634087 2.548938
