program: Gaussian 09
title: 000241805
version: EM64L-G09RevD.01
frameworkgroup: C1[X(C21H12BrNO2)]
method: RPBEPBE
basis: SDD
operation: Freq
keyword: #p
keyword: freq=noraman
keyword: PBEPBE/SDD
title: #p freq=noraman PBEPBE/SDD
converged: YES YES NO NO
title: Mulliken charges:
elementType: Br O O N C C C C C C C C C C C C C C C C C C C C C H H H H H H H H H H H H
charge: 0.001161 -0.182150 -0.185270 -0.376310 0.305484 -0.693270 0.192366 0.269727 0.205074 0.515582 -0.564513 -0.403912 -0.369777 -0.367757 -0.386490 0.179838 0.182980 0.061652 0.063458 -0.217584 -0.189775 -0.350226 -0.350042 -0.211660 -0.211812 0.251555 0.254487 0.280652 0.242571 0.270273 0.262550 0.246783 0.249596 0.271845 0.271645 0.240667 0.240602
chargesum: 0.00000
title: Mulliken charges with hydrogens summed into heavy atoms:
elementType: Br O O N C C C C C C C C C C C C C C C C C C C C C
charge: 0.001161 -0.182150 -0.185270 -0.376310 0.305484 -0.187229 0.192366 0.269727 0.205074 0.515582 -0.283861 -0.161342 -0.099504 -0.105207 -0.139706 0.179838 0.182980 0.061652 0.063458 -0.217584 0.059821 -0.078381 -0.078397 0.029008 0.028790
polarizability: 5.32464393e+02 -1.53832220e+00 2.34998071e+02 -4.67947675e+00 2.78929818e+00 1.10879340e+02
1716.lowfreq: -5.7615 -2.7624 -0.0007 -0.0003 0.0004 1.8389 19.5521 33.5340 39.8828
frequency: 19.4910 33.5076 39.8782 61.0472 97.6337 129.6294 133.4402 149.9619 158.4952 167.5863 191.5526 234.0950 240.0483 263.8573 281.1340 290.1144 346.2075 359.4564 389.1257 415.8363 425.7098 438.4905 452.0311 488.4494 511.2877 520.6097 524.1256 555.1673 559.2911 589.0603 626.1169 656.1175 660.2728 681.9353 692.9744 706.4950 712.8800 739.2233 757.2813 783.1580 784.5333 794.8923 822.2547 838.4549 841.9788 860.1794 867.9607 892.7311 907.0917 916.2148 954.2907 957.5694 967.1840 975.3153 993.9987 1007.1992 1010.0372 1037.2462 1055.8751 1077.7521 1086.5836 1115.7050 1133.5409 1142.4192 1167.9110 1173.0662 1178.0684 1183.4143 1203.4885 1227.8060 1249.6687 1282.4032 1285.3998 1305.4714 1333.4954 1370.6224 1376.5257 1413.2438 1417.6164 1426.6180 1449.3920 1454.1542 1454.4841 1457.3879 1489.2577 1576.0164 1587.8067 1610.0484 1615.7609 1618.6999 1628.0495 1630.0741 1677.0651 2987.1824 3032.1978 3139.7767 3140.7707 3142.1871 3154.4425 3157.0233 3166.1569 3172.1691 3175.6170 3176.9411 3189.0906
redmass: 8.5322 5.0500 7.3956 8.3223 8.4725 5.6726 5.1384 13.3719 5.9855 6.8598 6.0771 4.7479 2.4114 8.1367 7.9337 7.4742 10.3233 5.6611 4.1355 3.0609 3.1057 3.2119 4.8692 7.2818 4.0213 3.7510 6.5456 6.5981 9.2162 3.3169 8.7984 4.8255 6.9569 6.8448 5.5833 4.0938 2.9865 5.8012 3.0550 5.4356 5.7675 1.6190 1.4044 1.7490 4.9368 3.0267 1.8405 1.4556 1.3879 4.0824 1.5622 1.4188 1.7759 1.4099 7.1504 1.3481 2.2210 7.6976 2.0761 2.7262 2.3354 2.1630 1.1461 1.7491 1.2680 2.0608 1.5736 1.8861 1.6804 2.2899 2.0816 1.5030 1.5667 1.8557 6.5825 7.0528 4.4049 3.3369 6.4524 1.2112 4.5882 2.5618 2.5840 2.8167 3.5890 7.7547 7.3040 7.7258 7.7986 7.9090 8.5035 9.5073 12.8063 1.0610 1.0994 1.0901 1.0866 1.0902 1.0907 1.0930 1.0957 1.0959 1.1004 1.0928 1.0946
irintensity: 0.3508 0.3534 1.3520 0.8988 2.0912 0.5738 0.1407 0.0346 1.8283 0.8808 0.3526 1.9065 8.2373 3.0162 11.0739 6.9729 7.3322 1.1670 2.3322 4.2326 8.1413 0.7006 0.0012 0.0326 3.2387 5.2912 11.0981 1.1634 0.7548 0.2980 26.1201 1.0142 2.6066 5.8364 4.5930 27.8039 39.3530 1.5854 0.5626 6.8461 17.7298 50.3461 78.2519 0.4250 32.2884 19.3000 9.8328 5.4565 0.0779 8.7175 3.5580 1.3441 11.3547 2.0971 24.6005 0.0373 3.7557 100.0387 37.2941 0.6036 9.8520 12.1722 0.0756 5.0299 15.1838 2.6870 1.8251 25.7270 2.9342 53.4301 110.6216 0.4048 30.0285 3.4458 444.1449 3.8700 20.8588 49.8176 37.2493 26.1489 37.9768 78.3495 65.3634 2.7466 47.8573 14.1102 15.1101 19.9488 64.7792 1.1277 134.9983 196.3117 9.4766 8.6336 5.1210 5.1979 1.8453 12.5758 6.2095 3.1184 4.8504 7.7579 25.4799 0.9879 2.1105
temp: 298.150 k
press: 1.00000 atm
elementType: 35 8 8 7 6 6 6 6 6 6 6 6 6 6 6 6 6 6 6 6 6 6 6 6 6 1 1 1 1 1 1 1 1 1 1 1 1
symmnumber: 1
zpe: 703406.3 jmol-1
zpe.correction: 0.267913 hartree
zpe.thermalcorrener: 0.287143 hartree
zpe.thermalcorrenthalpy: 0.288087 hartree
zpe.thermalcorrgfe: 0.218306 hartree
zpe.sumelectzpe: -1024.476902 hartree
zpe.sumelectthermal: -1024.457672 hartree
zpe.sumelectthermalent: -1024.456728 hartree
zpe.sumelectthermalfe: -1024.526509 hartree
dipole: 5.0289 -0.5220 -0.1239
dipole: 5.0574
quadrupole: -121.0999 -147.5754 -156.7971
quadrupole: -7.0749 -1.4143 8.4706
quadrupole: 20.7242 -5.7513 -14.9730 -7.0749 -1.4143 8.4706
hfenergy: -1024.744815 hartree
pointgroup: C01 [X(C21H12Br1N1O2)]
dipole: 1.9848199 0.1372818 0.0276033 debye
polarizability: 532.2750432|-8.6130075|235.1806953|-0.0629823|3.870636|110.8860664 unknown
InChI: InChI=1S/C21H12BrNO2/c22-14-5-7-16-12(10-14)9-13-11-15(6-8-17(13)16)23-20(24)18-3-1-2-4-19(18)21(23)25/h1-8,10-11H,9H2
charge 0 multiplicity 1
37 atoms
Br -8.213878 0.781262 0.27979
O  2.669246 -2.340026 0.694143
O  2.22466 2.149441 -0.756728
N  2.045544 -0.138884 -0.044319
C  -1.610471 0.619359 0.218298
C  -2.714965 1.616235 0.549871
C  -2.179636 -0.622044 -0.198703
C  -3.98336 0.814169 0.282164
C  -3.647127 -0.502691 -0.158964
C  0.616124 -0.293378 -0.089758
C  -0.221356 0.791964 0.28367
C  -1.340807 -1.698612 -0.559825
C  0.057808 -1.530191 -0.510976
C  -5.325292 1.209874 0.416926
C  -4.664069 -1.431936 -0.469496
C  4.333867 -0.567891 0.23591
C  4.201322 0.771786 -0.193152
C  2.97326 -1.176147 0.341323
C  2.750653 1.07502 -0.380447
C  -6.325224 0.262056 0.100792
C  -6.017991 -1.045459 -0.338492
C  5.590976 -1.135355 0.492706
C  5.32111 1.595213 -0.384074
C  6.731451 -0.312194 0.303879
C  6.598457 1.032285 -0.128505
H  -2.660027 1.963001 1.600234
H  -2.656744 2.521486 -0.085446
H  0.216371 1.742205 0.59783
H  -1.75893 -2.658242 -0.881766
H  0.718251 -2.355764 -0.784061
H  -5.594841 2.215117 0.754136
H  -4.422771 -2.445069 -0.808337
H  -6.82211 -1.748378 -0.573258
H  5.678778 -2.174255 0.825187
H  5.204437 2.630805 -0.717969
H  7.730682 -0.718281 0.493592
H  7.497204 1.642716 -0.266374
