program: Gaussian 09
title: 000241801
version: EM64L-G09RevD.01
frameworkgroup: C1[X(C17H17Br2N)]
method: RPBEPBE
basis: SDD
operation: Freq
keyword: #p
keyword: freq=noraman
keyword: PBEPBE/SDD
title: #p freq=noraman PBEPBE/SDD
converged: YES YES NO NO
title: Mulliken charges:
elementType: Br Br N C C C C C C C C C C C C C C C C C H H H H H H H H H H H H H H H H H
charge: -0.023164 -0.023633 -0.180167 0.299280 -0.701622 0.187639 0.273530 0.185668 0.481638 -0.600558 -0.432702 -0.381059 -0.390800 -0.390277 -0.424258 -0.398609 -0.240193 -0.235434 -0.673173 -0.673188 0.244916 0.245342 0.246205 0.239250 0.233007 0.255888 0.252516 0.255764 0.254327 0.239901 0.236868 0.224526 0.224290 0.284002 0.309833 0.284783 0.309662
chargesum: 0.00000
title: Mulliken charges with hydrogens summed into heavy atoms:
elementType: Br Br N C C C C C C C C C C C C C C C C C
charge: -0.023164 -0.023633 -0.180167 0.299280 -0.211364 0.187639 0.273530 0.185668 0.481638 -0.354353 -0.193451 -0.148052 0.117604 0.119814 -0.184357 -0.161740 -0.015667 -0.011143 -0.079338 -0.078743
polarizability: 3.83192746e+02 1.01101705e+00 2.59329706e+02 -4.24196738e+00 2.92059524e+01 1.13651055e+02
1716.lowfreq: -4.9131 -3.9534 -0.0004 0.0004 0.0005 3.6243 20.0186 23.6774 29.3454
frequency: 19.9851 23.6595 29.3205 34.4343 69.6367 105.1131 116.9581 138.7578 139.8328 146.9350 188.3671 199.1507 210.0159 237.8891 270.6154 302.1779 339.6171 372.9135 422.4038 432.5166 461.0077 471.1740 508.4302 527.3408 543.0810 560.9501 592.3323 607.8268 636.8908 653.6865 695.8520 706.2087 738.6747 745.6002 765.5073 771.8796 773.1906 811.7666 818.7023 850.1617 869.8761 872.5860 930.2923 942.5303 951.7521 965.2106 966.4451 983.4530 990.7635 1016.7464 1025.6535 1026.9289 1033.0262 1095.7180 1109.9953 1130.0161 1131.2020 1155.2320 1168.2702 1186.3251 1199.2618 1207.0425 1216.9604 1221.8928 1224.6674 1248.8093 1277.0999 1292.1861 1304.5695 1310.8925 1343.5439 1348.1311 1370.4873 1380.7676 1391.8933 1427.3215 1445.4203 1451.1337 1451.7011 1460.9689 1464.4093 1482.5759 1494.6740 1503.4535 1582.4820 1590.9179 1620.6874 1631.7785 2981.6247 3011.9974 3017.9463 3025.4803 3060.8349 3061.7034 3068.2666 3074.0233 3119.8671 3126.6781 3130.7349 3140.9479 3143.3378 3147.4124 3148.3451 3160.0744 3160.9960
redmass: 13.5774 10.6569 8.1664 4.3320 4.5089 2.9035 2.6290 15.2431 4.7627 3.8673 4.7073 4.2794 3.8286 2.1477 3.6657 4.5189 4.0296 5.2451 2.7471 2.8693 3.3970 4.2670 3.3715 4.2540 5.4879 5.4073 2.9481 5.0397 5.8006 4.8016 4.5693 2.9786 1.7110 5.4353 1.1324 1.4920 1.4202 1.5835 4.3785 1.4543 1.3974 3.9411 1.6030 1.4090 1.9589 1.8098 1.3532 1.3282 4.0302 1.8656 2.3334 4.7613 3.2637 2.1490 1.5123 1.9388 1.1572 1.4779 1.1484 1.5896 1.8330 1.8515 2.2801 1.1654 1.1621 1.6953 1.4870 1.2028 1.5069 1.8704 1.2618 1.3645 6.0580 1.8946 3.5926 1.1509 2.4551 1.1804 1.1065 2.8491 2.8160 1.1648 2.9730 1.1595 7.0418 6.5385 7.2767 7.3215 1.0608 1.0601 1.0606 1.0993 1.0574 1.0583 1.1020 1.1037 1.0854 1.0893 1.0887 1.0945 1.0912 1.1113 1.1108 1.0992 1.0952
irintensity: 0.4076 0.1103 0.3911 0.3002 1.5211 1.3381 1.0158 1.0491 0.5183 0.1597 0.5497 2.2001 12.8480 9.3566 0.0980 9.6550 0.3458 11.4981 7.5201 0.6793 7.6513 8.2299 0.1251 24.4194 4.4993 5.7687 3.3323 87.4021 37.7458 64.9894 4.4721 0.9641 44.1752 0.5965 4.3596 46.9465 37.3114 20.9395 2.2112 12.0708 2.9017 0.6509 1.0051 0.9456 16.4205 10.5861 2.7124 0.1530 0.0161 0.6402 12.3521 2.2169 10.5050 9.4871 65.1972 55.7373 1.1505 18.5631 1.2438 1.9879 21.6485 3.3428 41.6355 35.9376 41.8990 11.4699 70.2157 8.2715 7.3041 3.7673 15.9234 66.1928 8.6236 63.4683 0.1470 18.1383 10.7140 38.7276 3.5669 154.4062 22.6826 30.3433 88.8425 71.2773 44.0409 3.7952 17.0536 219.2903 14.1489 26.1163 18.5926 7.8901 9.8366 12.8678 10.5030 9.6727 6.0551 6.4337 10.3526 31.5796 21.8212 8.2464 7.1090 56.6201 14.6269
temp: 298.150 k
press: 1.00000 atm
elementType: 35 35 7 6 6 6 6 6 6 6 6 6 6 6 6 6 6 6 6 6 1 1 1 1 1 1 1 1 1 1 1 1 1 1 1 1 1
symmnumber: 1
zpe: 772300.6 jmol-1
zpe.correction: 0.294154 hartree
zpe.thermalcorrener: 0.312799 hartree
zpe.thermalcorrenthalpy: 0.313743 hartree
zpe.thermalcorrgfe: 0.242709 hartree
zpe.sumelectzpe: -738.261630 hartree
zpe.sumelectthermal: -738.242985 hartree
zpe.sumelectthermalent: -738.242041 hartree
zpe.sumelectthermalfe: -738.313076 hartree
dipole: -0.7977 0.3423 0.1238
dipole: 0.8768
quadrupole: -139.4610 -145.8326 -139.3264
quadrupole: -0.1139 -1.2512 4.3857
quadrupole: 2.0790 -4.2926 2.2136 -0.1139 -1.2512 4.3857
hfenergy: -738.5557841 hartree
pointgroup: C01 [X(C17H17Br2N1)]
dipole: -0.3086973 -0.147487 -0.0442648 debye
polarizability: 383.114261|3.9613542|260.4287169|1.4390701|26.7238772|112.6305285 unknown
InChI: InChI=1S/C17H17Br2N/c18-7-9-20(10-8-19)15-5-6-17-14(12-15)11-13-3-1-2-4-16(13)17/h1-6,12H,7-11H2
charge 0 multiplicity 1
37 atoms
Br 5.271428 3.477323 -0.220465
Br 4.251499 -4.09667 0.091565
N  2.837213 -0.047118 0.020862
C  -0.852625 -0.691764 -0.205252
C  -1.985998 -1.668063 -0.506631
C  -1.391803 0.576086 0.16554
C  -3.235416 -0.822913 -0.273214
C  -2.862144 0.499339 0.123439
C  1.432909 0.149939 0.068646
C  0.530046 -0.914126 -0.251862
C  -0.510145 1.6287 0.489437
C  0.88252 1.419065 0.437957
C  3.776193 1.020386 0.405186
C  3.417899 -1.322376 -0.430965
C  -4.589346 -1.176684 -0.397511
C  -3.852736 1.46942 0.396534
C  -5.583287 -0.201941 -0.123315
C  -5.214873 1.108785 0.270051
C  4.024554 1.972549 -0.781773
C  3.498774 -2.322206 0.739996
H  -1.956152 -2.55384 0.158227
H  -1.934792 -2.051329 -1.544805
H  0.902749 -1.905217 -0.529126
H  -0.891549 2.615155 0.776246
H  1.540068 2.258005 0.683381
H  3.398555 1.583728 1.276326
H  4.734153 0.567357 0.715766
H  2.830084 -1.751932 -1.261108
H  4.433076 -1.140764 -0.82612
H  -4.880454 -2.189061 -0.70155
H  -3.577474 2.485763 0.7008
H  -6.643478 -0.462939 -0.215967
H  -5.994991 1.850009 0.477822
H  4.530899 1.472965 -1.621551
H  3.104569 2.466753 -1.126115
H  4.185717 -1.986374 1.531487
H  2.511762 -2.559008 1.162964
