program: Gaussian 09
title: 000241787
version: EM64L-G09RevD.01
frameworkgroup: C1[X(C14H11NO2)]
method: RPBEPBE
basis: SDD
operation: Freq
keyword: #p
keyword: freq=noraman
keyword: PBEPBE/SDD
title: #p freq=noraman PBEPBE/SDD
converged: YES YES NO NO
title: Mulliken charges:
elementType: O O N C C C C C C C C C C C C C C H H H H H H H H H H H
charge: -0.452311 -0.257190 -0.047601 0.152906 0.216079 0.099071 -0.322170 -0.401653 -0.288434 -0.258640 0.174522 -0.246865 -0.200619 -0.302363 -0.198419 -0.173823 -0.370272 0.284536 0.215352 0.327157 0.234097 0.264724 0.231684 0.240848 0.240973 0.232873 0.240820 0.364718
chargesum: 0.00000
title: Mulliken charges with hydrogens summed into heavy atoms:
elementType: O O N C C C C C C C C C C C C C C
charge: -0.087593 -0.257190 -0.047601 0.152906 0.216079 0.099071 -0.037635 -0.186301 0.038723 -0.024543 0.174522 0.017859 0.031065 -0.061515 0.042553 0.059049 -0.129451
polarizability: 3.29369122e+02 -3.94604667e+00 1.73751146e+02 -4.56302674e+00 -1.15826589e+00 6.50296872e+01
1716.lowfreq: -6.3890 -0.7341 0.0006 0.0007 0.0009 5.4026 16.8957 29.3539 53.7186
frequency: 16.6210 29.3473 53.7051 84.3104 114.9425 148.2925 192.2560 213.4860 247.4027 254.1283 297.6178 360.5242 381.1415 402.6972 432.4939 448.2074 501.6277 522.9843 536.3787 545.9203 591.1411 615.8003 647.5723 667.3407 741.1800 749.0837 762.9633 772.9072 795.7610 823.2373 854.4754 884.8136 895.9099 931.5311 959.8616 962.0202 963.6864 998.5730 999.0180 1013.9397 1019.8237 1037.8511 1053.7654 1076.5027 1089.6749 1153.9457 1165.7029 1172.4019 1191.1365 1211.1123 1239.0609 1285.3594 1294.5515 1307.2201 1312.5105 1333.3876 1390.6897 1409.9837 1429.0049 1453.4202 1480.8047 1509.2551 1553.2399 1572.9039 1591.7003 1609.4703 1638.4618 3108.3183 3112.2560 3123.4958 3137.2608 3140.4082 3153.0228 3153.2258 3170.4206 3171.7880 3197.1431 3573.1722
redmass: 5.4377 4.9308 5.6500 5.8897 4.7942 3.7975 5.0020 7.0278 3.3479 4.0653 7.2003 6.9614 1.1304 3.3074 3.4355 5.1996 2.8109 3.5510 6.0645 5.3469 6.9534 7.2349 6.3522 3.7520 2.2992 2.0543 1.3261 6.5902 2.5780 6.3323 1.4804 4.3043 1.3373 1.8956 1.3687 1.5168 6.5290 1.3482 1.3378 2.3812 1.4120 2.4010 2.1654 2.0558 1.6244 1.2426 1.0780 1.0705 1.4550 2.4411 2.5491 1.5075 3.7463 1.4198 2.0990 3.0190 6.8148 1.9366 2.5630 2.3510 2.4833 9.1694 5.2122 5.7626 6.5012 6.4854 5.9093 1.0890 1.0903 1.0889 1.0885 1.0880 1.0943 1.0928 1.1002 1.1014 1.0915 1.0659
irintensity: 0.1015 5.4497 2.2630 0.0150 0.3734 0.7468 0.8314 1.2763 0.6653 4.4724 4.0960 5.7368 123.2577 8.8448 0.6810 13.7783 14.8668 8.3778 6.4075 8.0116 37.9939 0.7121 2.5840 6.4214 20.8261 5.0197 130.8676 8.5606 22.8532 21.5150 0.1837 8.0892 0.1578 0.0426 1.0454 1.5541 2.3254 1.9699 1.6428 54.6716 53.9619 3.8640 5.2300 108.1246 6.8903 31.6898 2.9031 10.6269 24.4252 109.6155 7.9859 35.5994 19.2667 1.1095 111.6360 245.7100 14.6487 41.8155 82.6497 61.7295 15.6163 133.9741 33.5159 34.9552 32.7642 140.9411 118.0250 12.2872 1.9573 21.5570 3.0082 9.4922 21.5435 4.9466 39.5290 26.1931 13.9364 36.7936
temp: 298.150 k
press: 1.00000 atm
elementType: 8 8 7 6 6 6 6 6 6 6 6 6 6 6 6 6 6 1 1 1 1 1 1 1 1 1 1 1
symmnumber: 1
zpe: 556492.9 jmol-1
zpe.correction: 0.211957 hartree
zpe.thermalcorrener: 0.226300 hartree
zpe.thermalcorrenthalpy: 0.227244 hartree
zpe.thermalcorrgfe: 0.168370 hartree
zpe.sumelectzpe: -744.085742 hartree
zpe.sumelectthermal: -744.071399 hartree
zpe.sumelectthermalent: -744.070455 hartree
zpe.sumelectthermalfe: -744.129329 hartree
dipole: -0.9359 3.4053 -0.0854
dipole: 3.5326
quadrupole: -61.0911 -89.3722 -103.9306
quadrupole: 10.1814 -0.8866 1.4306
quadrupole: 23.7069 -4.5742 -19.1327 10.1814 -0.8866 1.4306
hfenergy: -744.2976991 hartree
pointgroup: C01 [X(C14H11N1O2)]
dipole: 0.2836124 -0.4108182 1.2970987 debye
polarizability: 321.6674369|35.0625072|80.6519502|25.8273895|-29.2445409|165.8305683 unknown
InChI: InChI=1S/C14H11NO2/c16-13-7-2-1-6-12(13)14(17)9-8-11-5-3-4-10-15-11/h1-10,16H
charge 0 multiplicity 1
28 atoms
O  -1.608891 -0.53552 1.693564
O  -0.85695 0.660922 -2.354948
N  2.776379 -0.253309 1.151479
C  -2.27343 -0.25526 -0.646639
C  -2.597659 -0.608625 0.698818
C  -0.927237 0.185446 -1.169631
C  -3.326678 -0.313131 -1.604814
C  -3.912969 -1.010144 1.046724
C  0.300107 0.033279 -0.343056
C  -4.631774 -0.71091 -1.269163
C  2.785141 0.322065 -0.103436
C  1.512893 0.442398 -0.82778
C  -4.925534 -1.065018 0.070269
C  3.989472 0.791607 -0.701392
C  5.208181 0.66973 -0.001085
C  5.199087 0.080421 1.283199
C  3.958735 -0.362276 1.810024
H  -3.065428 -0.025882 -2.628714
H  -4.139961 -1.276112 2.088113
H  0.226044 -0.403611 0.654044
H  -5.412457 -0.748179 -2.035241
H  1.545509 0.892448 -1.829855
H  -5.935983 -1.378749 0.354253
H  3.956987 1.242684 -1.699052
H  6.142961 1.025673 -0.44673
H  6.11888 -0.036381 1.864662
H  3.910436 -0.824473 2.803415
H  -1.97956 -0.78679 2.576072
