program: Gaussian 09
title: 000241786
version: EM64L-G09RevD.01
frameworkgroup: C1[X(C14H9NO2)]
method: RPBEPBE
basis: SDD
operation: Freq
keyword: #p
keyword: freq=noraman
keyword: PBEPBE/SDD
title: #p freq=noraman PBEPBE/SDD
converged: YES YES NO NO
title: Mulliken charges:
elementType: O O N C C C C C C C C C C C C C C H H H H H H H H H
charge: -0.290194 -0.244166 0.006703 0.191451 0.177692 0.273313 0.133972 0.310228 -0.418239 -0.353071 -0.353891 -0.246079 -0.206137 -0.288802 -0.444620 -0.193383 -0.336429 0.249176 0.282099 0.263715 0.238770 0.238976 0.242930 0.278312 0.238208 0.249465
chargesum: 0.00000
title: Mulliken charges with hydrogens summed into heavy atoms:
elementType: O O N C C C C C C C C C C C C C C
charge: -0.290194 -0.244166 0.006703 0.191451 0.177692 0.273313 0.133972 0.310228 -0.169063 -0.070972 -0.090176 -0.007309 0.032840 -0.045871 -0.166308 0.044825 -0.086963
polarizability: 2.74631149e+02 -3.10414208e+00 1.80352380e+02 1.30385678e+00 1.42056463e+00 6.27093417e+01
1716.lowfreq: -7.8975 -5.7817 -2.8395 -0.0008 -0.0003 0.0006 15.7239 57.8643 104.7615
frequency: 15.1079 57.8564 104.7600 120.6141 154.8518 192.3412 258.4145 272.6416 280.9919 336.9136 379.7097 420.4012 452.1096 486.7693 494.7716 519.3023 568.7777 588.7931 612.5677 648.5253 664.9379 681.4279 712.6748 733.8791 759.0448 783.6059 819.6564 828.9367 869.9882 872.2939 886.0370 929.2934 955.0420 973.3847 981.4448 989.7099 1002.6129 1009.0905 1024.4097 1041.7883 1076.0336 1117.6029 1129.8521 1163.5180 1199.5399 1202.4660 1243.2652 1257.1237 1287.9095 1306.4298 1328.0628 1343.3151 1399.7996 1405.5467 1446.6019 1459.3293 1463.1387 1544.6315 1556.3703 1571.7689 1588.3151 1613.6484 1622.5884 3138.7215 3141.1420 3150.4200 3153.3394 3166.1591 3167.4315 3174.7608 3177.1050 3181.9961
redmass: 4.6385 5.7319 5.6097 5.7684 4.6696 4.6437 7.0523 5.4659 6.3082 6.7788 2.9937 3.6639 4.4186 9.1400 7.4246 3.6424 8.7571 6.0879 7.6999 6.2779 3.0342 7.0027 1.8851 5.7641 2.5608 1.4228 1.8074 5.0953 1.5661 7.6644 1.5382 1.3660 1.5093 1.3694 5.6198 1.4073 1.3332 4.1914 2.3152 2.2938 3.6707 1.6485 1.6932 1.2208 2.4462 1.3405 2.0161 1.5923 2.3258 5.9543 2.3752 1.7153 9.4785 2.2014 2.5766 2.3962 2.4388 5.9743 8.1249 7.3049 5.9400 7.3770 7.3958 1.0881 1.0862 1.0916 1.0902 1.0955 1.0923 1.0997 1.1002 1.0918
irintensity: 3.8510 0.2815 1.7009 4.0736 1.5480 1.1404 3.0350 0.1696 2.5131 2.5225 2.1303 2.3539 0.8720 0.9589 0.4553 3.9003 0.9250 14.8456 0.7721 0.3410 7.7182 0.8826 32.5957 2.7566 16.7180 88.7142 36.7872 12.1254 23.5955 19.4034 2.9421 0.9589 3.5820 3.0392 13.3918 0.2246 0.1278 10.8605 11.5152 9.6689 4.7469 19.5867 30.3047 0.8290 45.5320 4.5966 0.0475 4.4101 15.7733 49.9041 110.8889 126.1104 4.8616 87.7240 62.9638 25.9055 2.9895 42.4826 98.2395 10.8958 11.5058 208.4628 87.0795 5.1739 3.3980 14.4877 3.8111 12.2761 10.6286 11.2345 18.0152 4.5656
temp: 298.150 k
press: 1.00000 atm
elementType: 8 8 7 6 6 6 6 6 6 6 6 6 6 6 6 6 6 1 1 1 1 1 1 1 1 1
symmnumber: 1
zpe: 504007.1 jmol-1
zpe.correction: 0.191966 hartree
zpe.thermalcorrener: 0.204640 hartree
zpe.thermalcorrenthalpy: 0.205585 hartree
zpe.thermalcorrgfe: 0.151192 hartree
zpe.sumelectzpe: -742.928766 hartree
zpe.sumelectthermal: -742.916092 hartree
zpe.sumelectthermalent: -742.915148 hartree
zpe.sumelectthermalfe: -742.969541 hartree
dipole: 0.7208 -1.4522 0.4242
dipole: 1.6758
quadrupole: -80.1921 -104.6089 -101.6714
quadrupole: 23.4291 1.2561 0.4578
quadrupole: 15.2987 -9.1181 -6.1806 23.4291 1.2561 0.4578
hfenergy: -743.1207327 hartree
pointgroup: C01 [X(C14H9N1O2)]
dipole: 0.2689328 0.598122 0.0678659 debye
dipolederiv: -1.3681802 0.3231698 0.1717347 0.2598127 -0.5961819 -0.1791505 0.12003 -0.1943733 -0.2222668 -0.7296316 -0.2681801 -0.091829 -0.2145534 -0.9864318 -0.2402638 -0.0614538 -0.2344547 -0.4445044 -0.5056876 -0.0085957 0.0180801 0.0393841 -0.2639292 -0.0183053 0.0500558 -0.0161979 -0.2613454 -0.323885 0.2205309 0.0986037 0.1955481 -0.4139777 -0.1619263 0.0900004 -0.1649388 -0.0855397 0.9448541 -0.144851 -0.0928176 -0.161907 0.2022693 0.0410277 -0.087639 0.039553 0.1356295 1.2156942 -0.0592886 -0.0537301 -0.1272297 0.775642 0.2449274 -0.0634984 0.2713616 0.2110379 1.433113 0.3156905 0.0790252 -0.0187767 1.0872147 0.3577812 -0.0791486 0.3368717 0.318014 -0.1891817 0.0158591 0.0074618 0.1355059 -0.0933375 -0.0930286 0.0444183 -0.103884 -0.0111942 -0.9784555 -0.4742973 -0.1517903 -0.274676 -0.3065416 -0.0414847 -0.0686491 -0.0309933 -0.1979295 0.0682436 -0.0870788 -0.0411217 0.1158013 0.0673922 0.0633227 0.0383785 0.0699035 -0.0760455 -0.271038 0.0723237 0.0322049 0.1413312 -0.0033995 0.0578465 0.0626841 0.0635268 -0.1482959 0.1230002 0.0479905 0.0066365 0.0656272 -0.224997 -0.0261186 0.0135404 -0.0258493 -0.1739246 0.044138 0.0265195 0.0017494 -0.0530313 0.1420973 0.1113879 -0.0307181 0.1086281 -0.0905886 0.094421 0.0312806 0.0134839 -0.0919997 0.0342597 0.0982078 -0.0451508 0.0861766 -0.0407171 0.1821578 0.01836 -0.0095681 -0.021169 0.129106 0.1232765 -0.0432085 0.1104344 0.0217816 -0.1515051 -0.1136272 -0.0681125 -0.3045226 -0.1005145 0.0219761 -0.1678188 0.0158354 -0.079249 0.2984657 0.0003229 -0.0270142 0.1464266 0.1029028 0.0930186 0.0631134 0.1055997 -0.0048787 0.01333 0.0652155 0.0279893 0.1104237 0.0610638 -0.0380687 0.0493716 -0.0383081 0.1372961 0.0992488 -0.0067536 -0.0000342 -0.0875605 0.0445799 -0.0403881 -0.0315783 -0.0436226 0.1400484 0.0643689 -0.0822747 -0.0284803 -0.0457619 0.030618 -0.0547722 -0.0112863 -0.0556302 0.1556321 -0.1234572 0.0011506 0.0125341 -0.00023 0.0982895 -0.0261481 0.0125215 -0.0265501 0.1540966 0.0270638 0.0823623 0.0377335 0.0908287 -0.0176082 -0.0729685 0.0401676 -0.0729628 0.1274218 0.1123164 -0.0682924 -0.0403742 -0.042218 0.0077997 -0.080169 -0.0344044 -0.0730396 0.0922487 0.0618104 0.0550873 0.0416061 0.0854181 0.0722881 -0.0443678 0.0837626 -0.0287866 0.1074063 -0.0217638 0.061496 0.0511255 0.0962384 0.0500449 -0.075444 0.0707482 -0.0742577 0.1100563 -0.1194404 -0.0241198 0.0049033 -0.0387101 0.1013511 -0.0201684 -0.0142383 -0.0240418 0.1258098 unknown
polarizability: 274.1322621|7.8036246|160.7881599|-6.6034706|43.8566148|82.772448 unknown
InChI: InChI=1S/C14H9NO2/c16-12-8-14(10-4-3-7-15-9-10)17-13-6-2-1-5-11(12)13/h1-9H
charge 0 multiplicity 1
26 atoms
O  -0.186494 0.83612 0.20518
O  -1.965231 -2.711437 -1.116639
N  3.830586 1.562555 0.590833
C  -2.239176 -0.470466 -0.220864
C  -1.591748 0.712406 0.219748
C  0.594435 -0.238624 -0.246312
C  -1.435249 -1.625049 -0.708255
C  2.03886 0.06309 -0.180487
C  0.014906 -1.413309 -0.677231
C  -3.657095 -0.516321 -0.178996
C  -2.31146 1.83088 0.690412
C  -4.392554 0.586286 0.287282
C  -3.716781 1.760134 0.721847
C  3.008366 -0.791345 -0.772828
C  2.51296 1.229222 0.48799
C  4.372876 -0.460853 -0.669947
C  4.74064 0.720696 0.016948
H  0.640194 -2.246327 -1.006404
H  -4.142009 -1.436337 -0.521642
H  -1.769991 2.722844 1.018248
H  -5.486061 0.545859 0.317322
H  -4.291198 2.619033 1.084595
H  2.704613 -1.691729 -1.315649
H  1.804695 1.91688 0.957824
H  5.14047 -1.098939 -1.117796
H  5.791749 1.014429 0.11342
