program: Gaussian 09
title: 000241795
version: EM64L-G09RevD.01
frameworkgroup: C1[X(C15H16N4O2)]
method: RPBEPBE
basis: SDD
operation: Freq
keyword: #p
keyword: freq=noraman
keyword: PBEPBE/SDD
title: #p freq=noraman PBEPBE/SDD
converged: YES YES NO NO
title: Mulliken charges:
elementType: O O N N N N C C C C C C C C C C C C C C C H H H H H H H H H H H H H H H H
charge: -0.265722 -0.268249 -0.410355 -0.165763 -0.070188 -0.219121 -0.320501 0.210380 0.095401 0.061916 0.457134 -0.703035 0.117001 0.203991 -0.616371 -0.388438 -0.440782 -0.599582 -0.235981 -0.220737 -0.239463 0.244245 0.360091 0.218383 0.226288 0.254707 0.272508 0.245348 0.245745 0.247307 0.237892 0.267933 0.249928 0.249776 0.232313 0.231573 0.234430
chargesum: 0.00000
title: Mulliken charges with hydrogens summed into heavy atoms:
elementType: O O N N N N C C C C C C C C C C C C C C C
charge: -0.265722 -0.268249 -0.050264 -0.165763 -0.070188 -0.219121 -0.076256 0.210380 0.095401 0.061916 0.457134 -0.003657 0.117001 0.203991 0.147229 -0.141131 -0.202891 0.168054 -0.003668 0.010835 -0.005033
polarizability: 2.59049468e+02 1.36502382e+01 1.97942091e+02 1.12182627e+01 -5.65152689e+00 1.30329612e+02
1716.lowfreq: -4.9517 -0.5073 -0.0008 -0.0008 -0.0006 5.0898 15.2188 29.5729 50.1608
frequency: 14.7646 29.5715 50.1564 70.2175 97.8218 110.3070 110.9822 119.1223 136.0545 169.0731 188.7810 200.5938 221.2554 236.8859 259.7937 303.1385 312.6946 331.5737 350.9303 367.4726 387.1945 404.4146 419.8085 454.7768 484.4406 527.1459 546.5355 588.5439 615.3219 641.6649 665.5823 677.4400 703.1370 704.3823 709.8701 737.3896 743.7129 766.5874 779.1857 793.3318 857.6373 924.1547 929.0802 951.0017 971.0917 979.6197 989.6390 998.8494 1001.7072 1027.9550 1039.3826 1056.5192 1066.7919 1095.3785 1107.7642 1129.3327 1132.1679 1174.7684 1189.0278 1190.3821 1199.9668 1214.0272 1227.3125 1261.4139 1269.6104 1285.3144 1296.1224 1333.8803 1361.2782 1376.2862 1382.3446 1388.3858 1416.5549 1427.7746 1441.6068 1451.9109 1468.0523 1473.0749 1475.3741 1478.6556 1479.9910 1481.8311 1487.2815 1521.2683 1577.3030 1592.7218 1613.1109 1614.4335 1658.6627 2967.3298 2997.2691 3006.4815 3011.4809 3095.4605 3096.3248 3103.5188 3109.9022 3120.1071 3120.6817 3136.9699 3137.3181 3138.4192 3148.8613 3166.9354 3573.1360
redmass: 4.9547 4.1125 5.0331 4.2655 1.1275 1.7937 2.6497 1.8972 4.6062 3.7916 5.8568 2.6701 1.5080 2.4897 4.3341 3.0003 5.5244 4.8718 3.6429 6.8652 7.7946 2.8102 6.6572 6.0520 7.8424 4.0435 4.1828 5.1097 6.2803 6.6258 5.3104 7.7344 1.3556 9.1114 1.5851 2.8939 11.0293 4.7334 2.2676 3.1714 1.2453 1.4287 4.2016 3.5770 3.4725 1.3979 5.3492 1.4764 2.0151 2.1075 3.0284 2.3356 1.6042 1.7330 3.7719 1.3044 1.2980 1.0576 2.6420 1.1400 2.0908 1.6590 2.7311 3.3526 3.1759 1.3287 5.1551 1.4240 4.4431 4.8535 3.4619 1.4160 1.3157 1.3376 2.1640 2.8796 1.0955 1.0444 1.1329 1.0784 1.0476 1.4435 1.6805 3.7328 8.2336 5.9783 6.1093 10.4800 10.5104 1.0823 1.0346 1.0336 1.0327 1.1025 1.1005 1.1021 1.1010 1.0879 1.0873 1.1025 1.0905 1.1011 1.0957 1.1014 1.0819
irintensity: 0.0663 0.0656 0.0627 0.1984 0.2140 1.1962 1.2923 2.5305 0.1143 0.2532 16.6122 1.9375 2.6006 0.1879 4.6624 1.1398 3.2614 13.9775 5.9159 1.4871 23.1908 0.0153 6.3772 12.1514 26.9989 5.2103 12.6620 7.1248 0.0587 1.2798 1.7037 1.3161 103.8067 2.0235 32.7999 7.2745 8.9607 0.3510 33.2497 8.4119 0.4344 4.3544 4.7694 8.8203 39.5903 0.4112 0.2287 2.9044 20.6150 2.6582 30.0194 8.0589 17.6526 6.0827 13.5859 0.2528 0.1609 0.1852 16.8332 3.3544 44.9018 57.4544 5.2842 48.3623 41.1645 7.5163 84.1847 5.4207 34.4371 33.6528 5.2354 11.3488 19.8065 68.3308 37.8374 205.0375 8.1938 18.5151 2.4627 4.0366 18.8738 38.8226 105.8732 47.7233 3.1486 1.6138 3.3352 612.3664 424.9841 10.0178 26.7724 36.3039 29.3004 16.3660 28.6074 17.5690 20.8412 6.7949 8.3982 0.7497 7.5215 0.5583 32.4832 20.7901 84.7086
temp: 298.150 k
press: 1.00000 atm
elementType: 8 8 7 7 7 7 6 6 6 6 6 6 6 6 6 6 6 6 6 6 6 1 1 1 1 1 1 1 1 1 1 1 1 1 1 1 1
symmnumber: 1
zpe: 765787.4 jmol-1
zpe.correction: 0.291673 hartree
zpe.thermalcorrener: 0.310804 hartree
zpe.thermalcorrenthalpy: 0.311748 hartree
zpe.thermalcorrgfe: 0.242628 hartree
zpe.sumelectzpe: -949.196098 hartree
zpe.sumelectthermal: -949.176967 hartree
zpe.sumelectthermalent: -949.176023 hartree
zpe.sumelectthermalfe: -949.245143 hartree
dipole: -4.7246 1.4151 -0.1737
dipole: 4.9350
quadrupole: -125.8833 -126.3651 -116.9178
quadrupole: 4.4036 1.8062 -2.3958
quadrupole: -2.8279 -3.3097 6.1376 4.4036 1.8062 -2.3958
hfenergy: -949.4877711 hartree
pointgroup: C01 [X(C15H16N4O2)]
dipole: 1.889818 0.2925053 0.3357963 debye
polarizability: 255.7468459|-23.8276394|178.6335705|4.8410761|32.1875855|152.9407541 unknown
InChI: InChI=1S/C15H16N4O2/c1-9(10-7-5-4-6-8-10)12-16-11-13(17-12)18(2)15(21)19(3)14(11)20/h4-9,16H,1-3H3
charge 0 multiplicity 1
37 atoms
O  -1.800538 -2.356344 -1.324849
O  -5.03504 0.782725 0.087149
N  0.2695 -0.444779 -0.000084
N  -2.791606 1.247174 0.598322
N  -0.356526 1.491511 1.009951
N  -3.410646 -0.761679 -0.601402
C  2.136187 0.947725 1.07112
C  0.696142 0.686804 0.67811
C  -1.121421 -0.372353 -0.118581
C  -1.472244 0.829495 0.514631
C  3.122247 0.044987 0.322816
C  2.475945 2.456534 0.914357
C  -2.065522 -1.264308 -0.734381
C  -3.817131 0.44778 0.03437
C  -3.138295 2.513383 1.271287
C  3.249355 0.115889 -1.090594
C  3.943585 -0.86596 1.032744
C  -4.507424 -1.571734 -1.179434
C  4.175481 -0.702495 -1.773542
C  4.87433 -1.684985 0.352341
C  4.992441 -1.606103 -1.053589
H  2.212687 0.708542 2.152328
H  0.862648 -1.18885 -0.369852
H  2.46024 2.757849 -0.147599
H  3.483426 2.658944 1.316787
H  1.734961 3.068138 1.4548
H  -4.231075 2.625956 1.223981
H  -2.645912 3.359832 0.763666
H  -2.802112 2.487915 2.321362
H  2.626179 0.817324 -1.658994
H  3.855615 -0.932709 2.124295
H  -4.049679 -2.459437 -1.640098
H  -5.056495 -0.982973 -1.932157
H  -5.216554 -1.868169 -0.389284
H  4.260846 -0.636432 -2.86386
H  5.502222 -2.382499 0.917599
H  5.711386 -2.240798 -1.583017
