program: Gaussian 09
title: 000241798
version: EM64L-G09RevD.01
frameworkgroup: C1[X(C14H28N3OP)]
method: RPBEPBE
basis: SDD
operation: Freq
keyword: #p
keyword: freq=noraman
keyword: PBEPBE/SDD
title: #p freq=noraman PBEPBE/SDD
converged: YES YES NO NO
title: Mulliken charges:
elementType: P O N N N C C C C C C C C C C C C C C H H H H H H H H H H H H H H H H H H H H H H H H H H H H
charge: 1.228025 -0.643339 -0.445598 -0.449606 -0.528767 0.004048 -0.007194 -0.490603 -0.472015 -0.394887 -0.399956 -0.337233 -0.345483 -0.403321 -0.368194 -0.683312 -0.691403 -0.346588 -0.393830 0.252599 0.265888 0.237747 0.269842 0.235642 0.259289 0.208950 0.199049 0.210777 0.199352 0.257146 0.204075 0.247040 0.196540 0.212112 0.193143 0.187549 0.241275 0.212929 0.247855 0.199228 0.215071 0.241915 0.207723 0.200301 0.184551 0.182412 0.199255
chargesum: 0.00000
title: Mulliken charges with hydrogens summed into heavy atoms:
elementType: P O N N N C C C C C C C C C C C C C C
charge: 1.228025 -0.643339 -0.445598 -0.449606 -0.528767 0.256647 0.258694 0.016985 0.022917 0.013112 0.010174 0.123988 0.098096 0.001933 0.060630 -0.023299 -0.026693 0.038264 -0.012163
polarizability: 2.14923952e+02 1.25796126e+00 2.03661037e+02 2.02640261e+00 3.58306284e-02 1.63993901e+02
1716.lowfreq: -28.4573 -13.7185 -0.0009 0.0009 0.0009 1.3835 15.5034 26.6832 35.3725
frequency: -20.7473 26.0374 35.1816 41.6247 54.1117 75.5695 88.3102 93.1223 96.2694 124.4712 140.8858 158.4608 184.1110 192.3216 208.3067 228.0968 233.2738 258.9514 277.5141 300.7529 311.0510 321.2650 332.8458 340.5034 379.7508 392.3797 403.7132 411.3917 440.0957 479.9196 491.4940 520.6450 573.8332 615.8960 676.0577 729.1246 742.4548 757.7682 802.3193 803.9196 804.9312 834.1328 835.9986 838.4728 876.6845 882.5932 905.6803 910.3396 919.8424 955.4745 956.9426 969.6365 986.4816 1002.5449 1019.3615 1022.7721 1045.0561 1046.6958 1048.5900 1057.8494 1089.2400 1092.4693 1102.4931 1107.9558 1116.9075 1126.0175 1131.0909 1132.2916 1168.7413 1171.3878 1173.3613 1185.0767 1215.7901 1232.5772 1236.2701 1238.6377 1260.0402 1263.2090 1264.2178 1283.2916 1308.8708 1309.9711 1317.2375 1329.6685 1336.6624 1348.9645 1350.9813 1360.1458 1375.9558 1383.8107 1383.9423 1397.4397 1397.6361 1450.1287 1455.0248 1455.1533 1456.0939 1457.2860 1460.7621 1461.5086 1466.3978 1477.0790 1477.1952 1478.3526 1485.1086 1488.1113 1488.6465 2926.4096 2951.5945 2965.4955 2970.1940 2973.4843 2976.3912 2977.2414 2978.6121 2982.1814 2982.6245 3009.8308 3019.9190 3030.3714 3037.0996 3038.4447 3040.3358 3044.4797 3054.1353 3063.3802 3065.1490 3066.8787 3068.3534 3076.4300 3076.9085 3084.9522 3088.1838 3176.8920 3177.2206
redmass: 3.3986 3.4481 3.2803 3.5625 3.6804 3.3352 3.0655 2.5908 2.4303 2.5282 2.9140 3.1544 2.9274 2.9241 3.7952 1.2438 1.2308 3.1228 2.7830 2.7588 2.6678 2.6396 3.4571 2.8246 3.0996 3.0105 3.0152 2.6246 3.2218 3.3147 1.6657 3.5454 3.8615 6.2279 3.1654 2.8292 2.6040 2.2708 1.3049 1.5533 1.3221 2.7998 2.0604 2.4637 1.8799 1.9472 2.7465 4.8268 4.3336 1.2028 1.2063 2.2389 6.1542 1.8636 1.3132 1.4864 2.0697 1.8316 1.7288 2.0614 1.5656 1.5959 1.9191 1.3251 1.3265 2.2131 1.4438 1.4282 1.9778 1.8888 1.7016 1.7787 1.5478 1.7355 1.3281 1.7530 1.3698 1.2057 1.2122 1.1829 1.3444 1.3419 1.3517 1.3625 1.3035 1.3670 1.3454 1.3683 1.3040 1.3827 1.4453 1.6030 1.5368 1.1907 1.0786 1.1098 1.1203 1.1003 1.0811 1.0824 1.0925 1.0441 1.0441 1.0747 1.0696 1.0710 1.0611 1.0686 1.0616 1.0634 1.0617 1.0638 1.0654 1.0371 1.0379 1.0591 1.0607 1.0982 1.0963 1.1010 1.0976 1.0973 1.0976 1.0957 1.0982 1.0695 1.0720 1.0752 1.0757 1.0965 1.0970 1.1004 1.1010 1.1177 1.1177
irintensity: 0.0309 0.3050 1.1538 0.1553 0.0433 0.2284 1.0905 1.8097 1.4608 1.4989 2.9477 3.1934 2.8603 9.7598 6.5070 1.7830 4.1928 1.3718 1.8665 4.5407 0.7938 1.8523 6.9669 3.4989 3.7900 11.8132 5.8418 2.7783 1.8962 13.4242 9.2883 16.2700 21.3639 106.7804 50.6817 6.4509 5.3020 10.2943 6.2224 9.1790 9.3376 107.8087 7.0374 52.5742 3.3659 25.9815 32.9039 137.6971 127.5885 5.8982 16.2127 2.2674 47.3172 17.9684 2.4519 2.0001 14.4053 69.0299 9.4190 13.0316 4.8563 5.1540 6.0030 4.8335 9.0781 3.4468 2.6599 2.6484 4.5911 12.8115 24.4083 24.5092 12.1913 37.5159 14.7674 13.2458 7.3659 0.0229 0.0671 10.7604 14.1532 7.3639 9.1282 0.0929 3.1128 2.6569 1.8233 0.4180 6.9029 9.9873 13.3509 9.6421 10.5550 8.9122 8.3458 8.6520 2.2795 18.1442 4.9876 2.8685 11.7422 5.0472 15.4514 21.8452 10.2013 10.4001 19.0106 63.3057 31.8497 12.2720 56.9406 66.2665 44.2422 31.2776 40.3380 36.0890 27.1984 52.6756 30.6178 77.8072 3.5630 5.0224 16.9989 12.9269 60.2186 10.1878 11.6536 22.4968 17.2324 15.8801 94.3596 59.1780 45.7850 5.8790 8.3839
temp: 298.150 k
press: 1.00000 atm
elementType: 15 8 7 7 7 6 6 6 6 6 6 6 6 6 6 6 6 6 6 1 1 1 1 1 1 1 1 1 1 1 1 1 1 1 1 1 1 1 1 1 1 1 1 1 1 1 1
symmnumber: 1
zpe: 1070157.0 jmol-1
zpe.correction: 0.407601 hartree
zpe.thermalcorrener: 0.429117 hartree
zpe.thermalcorrenthalpy: 0.430061 hartree
zpe.thermalcorrgfe: 0.356647 hartree
zpe.sumelectzpe: -1129.354094 hartree
zpe.sumelectthermal: -1129.332578 hartree
zpe.sumelectthermalent: -1129.331634 hartree
zpe.sumelectthermalfe: -1129.405048 hartree
dipole: -0.2164 0.1046 -1.6616
dipole: 1.6789
quadrupole: -114.9270 -115.0676 -134.4729
quadrupole: 0.8305 -0.2437 -1.2468
quadrupole: 6.5622 6.4216 -12.9838 0.8305 -0.2437 -1.2468
hfenergy: -1129.7616952 hartree
pointgroup: C01 [X(C14H28N3O1P1)]
dipole: 0.065279 0.0331535 0.6564735 debye
polarizability: 214.9021366|0.8868851|203.5290421|2.8194394|1.8111863|164.1477115 unknown
InChI: InChI=1S/C14H28N3OP/c1-3-13-11-16(13)19(18,17-12-14(17)4-2)15-9-7-5-6-8-10-15/h13-14H,3-12H2,1-2H3
charge 0 multiplicity 1
47 atoms
P  0.287819 0.124595 -0.872475
O  0.384349 0.268133 -2.476432
N  0.955414 -1.384034 -0.170804
N  1.220603 1.328444 0.085243
N  -1.327457 0.228308 -0.273896
C  2.293209 -1.894517 -0.684732
C  1.23727 2.756539 -0.444273
C  1.009551 -2.592198 -1.092038
C  2.478682 1.894878 -0.557734
C  3.234168 -2.439828 0.375975
C  1.082137 3.847666 0.601251
C  -2.420159 0.567909 -1.213182
C  -1.61205 0.041409 1.167978
C  -3.729071 -0.226717 -0.962059
C  -1.993245 -1.413943 1.534332
C  3.967915 -1.308159 1.129642
C  -0.396581 4.072964 0.987247
C  -3.535402 -1.711901 -0.564189
C  -3.340763 -1.912739 0.96221
H  2.765097 -1.294069 -1.477945
H  0.696976 2.919973 -1.389987
H  0.724851 -3.533372 -0.609632
H  0.669022 -2.453985 -2.126638
H  3.31054 2.03899 0.139757
H  2.742208 1.53551 -1.561178
H  2.648377 -3.047906 1.0907
H  3.965767 -3.117006 -0.109718
H  1.666983 3.567517 1.497614
H  1.519677 4.785781 0.203669
H  -2.041588 0.365848 -2.232086
H  -2.653643 1.654626 -1.162372
H  -0.713147 0.334002 1.741759
H  -2.421757 0.744025 1.454152
H  -4.330213 -0.15361 -1.890269
H  -4.325766 0.272176 -0.172008
H  -2.020237 -1.497542 2.641227
H  -1.165903 -2.05988 1.186092
H  4.62635 -1.714165 1.918642
H  3.234572 -0.629113 1.600045
H  4.594839 -0.711007 0.44012
H  -0.49444 4.856572 1.760192
H  -0.834041 3.139255 1.383889
H  -0.995147 4.38441 0.110393
H  -2.675764 -2.141314 -1.116998
H  -4.431817 -2.283851 -0.87619
H  -4.176351 -1.399293 1.484048
H  -3.441735 -2.990582 1.202861
