program: Gaussian 09
title: 000241752
version: EM64L-G09RevD.01
frameworkgroup: C1[X(C8H7ClO2)]
method: RPBEPBE
basis: SDD
operation: Freq
keyword: #p
keyword: freq=noraman
keyword: PBEPBE/SDD
title: #p freq=noraman PBEPBE/SDD
converged: YES YES NO NO
title: Mulliken charges:
elementType: Cl O O C C C C C C C C H H H H H H H
charge: -0.076773 -0.439389 -0.247260 0.548723 -0.487414 0.258125 -0.343161 -0.327373 -0.203549 -0.770044 0.116744 0.278833 0.245157 0.279795 0.237307 0.273828 0.269588 0.386862
chargesum: 0.00000
title: Mulliken charges with hydrogens summed into heavy atoms:
elementType: Cl O O C C C C C C C C
charge: -0.076773 -0.052527 -0.247260 0.548723 -0.208581 0.258125 -0.098004 -0.047578 0.033758 -0.226628 0.116744
polarizability: 1.42553194e+02 1.55393214e+00 1.07365666e+02 3.87335243e+00 -4.70452044e+00 5.64478459e+01
1716.lowfreq: -9.7314 -4.0944 -0.0033 -0.0029 -0.0022 1.2101 34.9468 57.4592 105.0606
frequency: 34.9176 57.4513 105.0599 159.3871 173.6747 257.3598 316.4107 371.7757 417.4384 465.1358 497.0860 554.8405 591.2045 597.8551 638.9972 698.6144 714.6805 734.4287 826.8323 875.6267 911.6551 945.7556 955.6610 990.5226 1002.8179 1041.0514 1091.1753 1126.4495 1137.7403 1184.2661 1230.3092 1249.1090 1305.1966 1326.2881 1394.8109 1440.5360 1462.9267 1474.7493 1591.0791 1616.6297 1645.8558 3067.4260 3133.0226 3146.8117 3149.3851 3156.3847 3181.6592 3531.9799
redmass: 7.4011 10.3789 7.1077 4.8397 4.5237 5.6678 2.9847 6.1716 3.0670 4.4387 5.4401 4.8198 2.1263 3.2866 2.7410 2.2908 4.0347 5.2297 1.6049 3.2139 1.8048 1.4561 1.4818 6.1549 1.3692 2.6992 1.6334 1.1602 1.4207 1.1033 2.2314 1.1884 1.3742 2.5773 9.1637 3.0978 1.1571 2.5261 6.3026 6.3089 8.7317 1.0577 1.0886 1.0964 1.1073 1.0937 1.0968 1.0642
irintensity: 1.3567 1.2777 1.8536 0.7031 2.3756 2.4124 3.4983 8.5231 4.1722 7.1496 28.4346 40.0048 61.8258 19.0865 151.0423 28.3949 13.2482 29.9824 19.0613 4.0758 12.5131 2.0028 10.2977 0.6791 0.4000 255.8049 10.5577 28.3100 126.1933 0.6352 11.9316 24.3930 7.0317 69.5860 2.5783 17.3952 11.5856 5.0502 17.4385 28.4645 236.9207 19.5100 4.7360 2.0414 3.4949 13.7981 4.8027 48.4048
temp: 298.150 k
press: 1.00000 atm
elementType: 17 8 8 6 6 6 6 6 6 6 6 1 1 1 1 1 1 1
symmnumber: 1
zpe: 344405.1 jmol-1
zpe.correction: 0.131177 hartree
zpe.thermalcorrener: 0.141156 hartree
zpe.thermalcorrenthalpy: 0.142100 hartree
zpe.thermalcorrgfe: 0.093938 hartree
zpe.sumelectzpe: -918.782965 hartree
zpe.sumelectthermal: -918.772986 hartree
zpe.sumelectthermalent: -918.772042 hartree
zpe.sumelectthermalfe: -918.820204 hartree
dipole: -1.1401 2.7572 1.3490
dipole: 3.2744
quadrupole: -67.0162 -70.0162 -71.1601
quadrupole: 1.0391 7.8227 -0.8087
quadrupole: 2.3813 -0.6187 -1.7626 1.0391 7.8227 -0.8087
hfenergy: -918.9141421 hartree
pointgroup: C01 [X(C8H7Cl1O2)]
dipole: -0.3057431 1.1093734 0.5791514 debye
dipolederiv: -0.5521688 0.1957084 0.1134763 0.2265084 -0.2824023 -0.0630818 0.3938612 -0.2071859 -0.3855968 -1.1991476 0.3616571 -0.1472082 0.4444289 -0.4737275 0.0678855 -0.1861163 0.0582698 -0.4586491 -0.7527019 -0.2280793 -0.0007382 -0.1950992 -0.9885352 0.1116338 -0.0251607 0.089946 -0.3477728 -0.0700239 -0.0702527 0.0146843 -0.0556898 -0.1350919 0.0102628 -0.1029984 0.0600361 -0.126515 0.0765689 0.1158642 0.0027739 -0.0319106 0.0014217 -0.0344872 0.0429026 0.0053324 -0.0991942 -0.5240992 -0.1863606 -0.0265855 -0.2372479 -0.1922688 0.0002682 -0.0366245 0.0131548 0.0200411 0.0856685 0.066395 0.0282873 -0.0149337 0.0501214 -0.0187457 0.0069963 -0.0240134 -0.113183 0.08921 -0.042198 0.0451455 0.181499 0.0143322 -0.0100914 -0.0019077 -0.02748 -0.1042803 -0.2982495 0.0282292 -0.0074389 0.0159298 0.1716129 -0.0401086 -0.0237302 -0.0526536 -0.1319075 0.6840657 -0.2606798 -0.1901617 -0.3157593 0.3188272 0.1119526 -0.3255475 0.1802128 0.5155139 1.9657272 0.1582569 0.1643629 0.1418574 1.3000759 -0.2008654 0.2113762 -0.1689461 0.2915258 0.1328275 0.0013773 -0.0108313 0.0226909 -0.0019505 0.0258899 -0.0038425 0.0229766 0.1382629 -0.0550989 -0.0820285 -0.0186267 -0.0632315 0.0717071 0.0088109 -0.0126962 0.0004904 0.1381102 0.0394262 0.0622992 -0.0258404 0.0612473 0.084615 0.019565 -0.0230058 0.0200804 0.1538765 0.0783034 -0.0093308 -0.0074331 -0.0113543 -0.103873 0.0361473 -0.0093949 0.0417261 0.1495126 0.0358184 -0.0353508 0.0869252 0.0428465 -0.0349656 0.0556799 0.0644556 0.0278406 -0.0165249 -0.0480693 0.0058303 -0.020526 -0.0574225 0.0213725 -0.1011771 0.0142018 -0.0681323 -0.0215985 0.3119435 -0.081337 -0.0002653 -0.1543595 0.1787289 0.0204614 0.0172309 0.0283454 0.398379 unknown
polarizability: 142.6124953|-2.350606|107.6692397|-1.0851784|-3.488551|56.084971 unknown
InChI: InChI=1S/C8H7ClO2/c9-5-6-2-1-3-7(4-6)8(10)11/h1-4,10H,5H2
charge 0 multiplicity 1
18 atoms
Cl 3.620896 -1.264878 -0.96222
O  -3.34433 0.1718 -0.30945
O  -2.391584 -1.885757 0.191284
C  1.47052 0.018013 0.359931
C  0.22003 -0.638677 0.302227
C  -0.963212 0.091018 0.027997
C  1.521652 1.420308 0.135954
C  -0.901671 1.490309 -0.195356
C  0.344871 2.149446 -0.139887
C  2.72306 -0.752721 0.655508
C  -2.249868 -0.655908 -0.01184
H  0.143257 -1.719819 0.464609
H  2.488808 1.935577 0.172305
H  -1.822895 2.039979 -0.406476
H  0.398926 3.229589 -0.310416
H  2.532161 -1.706017 1.167458
H  3.47792 -0.163197 1.194872
H  -4.169643 -0.383065 -0.324799
