program: Gaussian 09
title: 000241749
version: EM64L-G09RevD.01
frameworkgroup: C1[X(C6H10Cl2O)]
method: RPBEPBE
basis: SDD
operation: Freq
keyword: #p
keyword: freq=noraman
keyword: PBEPBE/SDD
title: #p freq=noraman PBEPBE/SDD
converged: YES YES NO NO
title: Mulliken charges:
elementType: Cl Cl O C C C C C C H H H H H H H H H H
charge: -0.067725 -0.056151 -0.271206 0.106308 -0.612485 -0.630998 -0.311422 -0.053216 -0.564412 0.221743 0.284772 0.299336 0.295108 0.259206 0.223351 0.200740 0.237125 0.222269 0.217657
chargesum: 0.00000
title: Mulliken charges with hydrogens summed into heavy atoms:
elementType: Cl Cl O C C C C C C
charge: -0.067725 -0.056151 -0.271206 0.328051 -0.028376 -0.076684 0.112669 0.183908 -0.124486
polarizability: 1.06161168e+02 2.53925720e+00 8.34425334e+01 9.47930339e+00 5.71406327e+00 6.65981975e+01
1716.lowfreq: -10.0871 -8.3855 -5.2927 -0.0029 -0.0020 0.0020 39.8125 45.2825 70.5504
frequency: 39.7367 44.9169 70.4482 78.5131 108.5224 116.6486 190.4588 224.5480 288.0250 344.4724 412.7432 437.5490 536.8794 613.2449 621.5581 727.2966 825.4929 852.1522 916.0544 945.6008 950.3881 969.8718 975.4310 1009.2553 1041.7253 1073.5775 1148.7034 1170.8823 1190.6969 1211.1735 1233.4277 1276.9684 1280.5127 1304.4515 1320.0198 1364.7692 1422.1174 1433.5996 1434.4093 1467.4131 1665.3148 2915.0459 2949.0065 3006.0457 3065.5871 3067.5229 3090.7801 3119.4712 3154.5051 3159.1162 3201.0662
redmass: 4.0348 2.7765 4.3957 4.1392 2.9268 5.4231 3.6180 6.6518 2.9276 2.6146 2.6716 2.8341 3.8440 2.7870 2.3902 4.9558 2.7789 1.7026 1.6759 2.0595 1.4353 1.7336 2.5678 1.2293 2.8228 1.6521 1.6341 1.3330 1.2771 1.1908 1.2538 1.2677 1.2419 1.1977 1.3394 1.3313 1.0950 1.1009 1.2058 1.0868 4.8480 1.0818 1.0554 1.1058 1.0577 1.0575 1.0605 1.0944 1.1104 1.1100 1.1143
irintensity: 2.4138 1.7176 1.0546 5.7165 2.0185 1.7291 1.9196 1.3639 3.2157 5.2948 3.1588 6.8499 25.7752 18.1423 0.7613 37.9039 2.8872 1.5353 6.7019 23.4742 80.9348 2.5252 41.3637 18.4896 136.8847 4.4629 1.9990 5.2331 20.2740 4.0162 1.4698 18.5420 2.3996 46.8563 4.2602 2.0936 14.0094 16.3298 11.4405 10.0495 3.9784 33.0867 33.2674 32.6194 14.8763 13.4756 10.3487 6.7540 2.0294 9.5044 25.4508
temp: 298.150 k
press: 1.00000 atm
elementType: 17 17 8 6 6 6 6 6 6 1 1 1 1 1 1 1 1 1 1
symmnumber: 1
zpe: 389191.4 jmol-1
zpe.correction: 0.148235 hartree
zpe.thermalcorrener: 0.159459 hartree
zpe.thermalcorrenthalpy: 0.160403 hartree
zpe.thermalcorrgfe: 0.108512 hartree
zpe.sumelectzpe: -1229.208771 hartree
zpe.sumelectthermal: -1229.197548 hartree
zpe.sumelectthermalent: -1229.196603 hartree
zpe.sumelectthermalfe: -1229.248494 hartree
dipole: 0.4368 0.3853 1.7969
dipole: 1.8890
quadrupole: -66.1606 -77.2524 -64.6158
quadrupole: -3.7549 -2.6367 -0.1688
quadrupole: 3.1823 -7.9095 4.7272 -3.7549 -2.6367 -0.1688
hfenergy: -1229.3570066 hartree
pointgroup: C01 [X(C6H10Cl2O1)]
dipole: 0.1291979 -0.0866975 0.7267172 debye
dipolederiv: -0.2412896 -0.0253269 -0.0194788 0.0084965 -0.5398539 -0.0995857 0.0004281 -0.1652009 -0.2243 -0.2434127 -0.0674628 -0.1190815 -0.0691377 -0.2824565 -0.0703884 -0.1598528 -0.1236815 -0.414714 -1.1370786 -0.1513403 0.0711744 -0.283707 -0.4898158 0.0925649 0.1835516 0.0841193 -0.3725357 0.8338029 -0.0783213 -0.1625837 -0.0809195 0.1498827 -0.0627394 -0.3814148 -0.2347185 0.1940702 0.0203116 0.1127853 0.0420006 0.1311489 0.590689 0.2289618 0.0390182 0.2971544 0.20926 0.1701952 0.1465368 0.1992453 0.0795582 0.1732195 0.144831 0.2576568 0.1737384 0.6021674 0.7043511 0.1553563 0.0481034 0.4219292 0.4565723 -0.1038333 0.0433695 -0.0573928 0.2968228 0.0774582 -0.0642063 0.0223797 -0.0910194 -0.1713878 0.1068103 -0.0438137 0.1025096 0.1025825 -0.1503438 -0.0494222 -0.0415609 -0.0745764 -0.3322342 0.1606714 -0.011579 0.1674103 0.0272926 -0.0455729 -0.0259592 -0.0725078 -0.0209265 0.0236639 -0.0766793 0.0775245 0.0355077 -0.1421957 -0.0931078 -0.0395992 0.0216418 -0.037583 0.0014839 -0.0367319 0.0278992 -0.0327829 0.0751429 0.123831 -0.0168087 0.0279879 -0.0189119 -0.0150601 -0.048698 0.0086042 0.0043865 -0.0365364 0.0457702 0.073449 -0.0742598 0.0606185 -0.0152669 -0.0062134 -0.0759923 -0.0212595 0.0006303 -0.0652762 -0.0619159 0.0457443 -0.0344911 0.0876691 -0.0421944 0.0398709 -0.0167591 -0.0842245 -0.0727396 0.060261 -0.0456924 -0.0562138 -0.1097671 0.0601471 -0.041753 0.0855614 0.0295733 -0.0029527 -0.0337853 0.0004855 -0.0717469 0.0225848 -0.0084581 -0.0205953 -0.0619917 -0.1648828 0.067718 0.0006502 -0.0299523 0.0668844 0.129056 -0.0811986 0.0055242 -0.0812323 -0.0660463 -0.0813224 0.0471937 0.0703247 0.0647694 0.1703847 -0.0579159 0.0750445 -0.060945 0.0523464 0.0896579 0.0179156 0.0160297 0.005828 0.1506365 -0.0993502 -0.023491 -0.0944235 -0.0844529 unknown
polarizability: 102.1799199|6.5026491|78.5818323|9.1389384|13.5538836|75.4401463 unknown
InChI: InChI=1S/C6H10Cl2O/c1-2-3-9-6(4-7)5-8/h2,6H,1,3-5H2
charge 0 multiplicity 1
19 atoms
Cl -1.48244 2.321946 1.01551
Cl -2.354372 -2.100462 -1.213077
O  0.319049 -0.56672 -0.068804
C  -0.950955 -0.452893 0.644769
C  -1.857247 0.685856 0.136072
C  -1.632538 -1.818206 0.511042
C  1.296339 0.518139 0.195369
C  2.599397 0.094011 -0.430085
C  3.806644 0.184081 0.179185
H  -0.762957 -0.302277 1.734815
H  -2.9197 0.492194 0.344971
H  -1.702548 0.867947 -0.936132
H  -0.899106 -2.622368 0.660525
H  -2.484852 -1.914929 1.199849
H  0.930236 1.461871 -0.259672
H  1.402941 0.684866 1.287971
H  2.520409 -0.283929 -1.458676
H  4.729485 -0.10119 -0.337244
H  3.909411 0.549163 1.208713
