program: Gaussian 09
title: 000241740
version: EM64L-G09RevD.01
frameworkgroup: C1[X(C6H12OS)]
method: RPBEPBE
basis: SDD
operation: Freq
keyword: #p
keyword: freq=noraman
keyword: PBEPBE/SDD
title: #p freq=noraman PBEPBE/SDD
converged: YES YES NO NO
title: Mulliken charges:
elementType: S O C C C C C C H H H H H H H H H H H H
charge: 0.134050 -0.303570 0.043554 -0.356430 -0.714430 -0.326931 -0.633030 -0.667104 0.253087 0.224984 0.217656 0.255163 0.253170 0.289341 0.210480 0.230713 0.220021 0.215100 0.233441 0.220734
chargesum: 0.00000
title: Mulliken charges with hydrogens summed into heavy atoms:
elementType: S O C C C C C C
charge: 0.134050 -0.303570 0.296641 0.086209 -0.206096 -0.037590 0.028185 0.002171
polarizability: 1.05400643e+02 2.35168171e+00 8.11032104e+01 5.96229012e+00 -3.78442579e-01 6.67600422e+01
1716.lowfreq: -20.5246 -9.8777 -4.7456 -0.0027 -0.0017 0.0030 31.1011 68.0733 83.0638
frequency: 29.5778 67.9960 83.0558 179.1215 198.5791 210.3574 237.5483 294.9182 324.9194 357.0911 395.0334 432.7271 570.7242 674.0123 695.1392 800.2371 872.3818 882.3938 888.8436 926.5558 953.0871 1018.0280 1058.2773 1069.2363 1098.9555 1116.7413 1135.5696 1161.5915 1200.9208 1231.8314 1242.7765 1256.0372 1320.8006 1371.2016 1377.4288 1392.4142 1424.2034 1458.0222 1465.9946 1475.2298 1477.4031 1484.4087 2973.9415 2978.4910 3016.5904 3050.0652 3061.8210 3064.8535 3075.9670 3083.2535 3085.3831 3094.9646 3106.5904 3168.7992
redmass: 2.8117 3.6110 4.3072 3.2563 2.3057 1.1752 1.1839 2.8842 2.8952 2.8626 2.3084 3.0832 3.4092 4.4168 6.2794 2.9672 1.8951 2.4737 1.9228 1.1793 1.3574 1.1549 1.3665 1.7751 1.2858 1.3030 2.3620 1.9299 1.3812 1.4479 1.3006 1.2441 1.3917 1.7001 1.2817 1.2095 1.1367 1.0514 1.0441 1.0482 1.1775 1.0458 1.0363 1.0354 1.0583 1.0888 1.0527 1.0973 1.0973 1.1022 1.1001 1.0993 1.0939 1.1186
irintensity: 0.4645 9.3091 4.0852 2.1796 0.0385 0.1381 0.5950 2.6110 1.7195 0.6984 5.0119 3.5915 4.5890 3.1055 9.8029 33.2229 9.5937 4.4092 5.2471 5.6222 0.4356 1.1541 21.6430 4.5359 6.0889 9.9336 0.8600 27.0778 1.6314 7.3880 6.4931 15.2241 1.4787 3.8141 20.1722 17.5986 16.9761 8.3703 4.1798 6.1059 2.4898 18.1471 27.4581 34.6458 19.9267 2.2737 33.8919 10.3587 39.5564 0.9343 23.2553 44.3592 18.0377 30.9865
temp: 298.150 k
press: 1.00000 atm
elementType: 16 8 6 6 6 6 6 6 1 1 1 1 1 1 1 1 1 1 1 1
symmnumber: 1
zpe: 440657.0 jmol-1
zpe.correction: 0.167837 hartree
zpe.thermalcorrener: 0.178152 hartree
zpe.thermalcorrenthalpy: 0.179096 hartree
zpe.thermalcorrgfe: 0.131299 hartree
zpe.sumelectzpe: -708.406522 hartree
zpe.sumelectthermal: -708.396207 hartree
zpe.sumelectthermalent: -708.395263 hartree
zpe.sumelectthermalfe: -708.443060 hartree
dipole: 1.7165 0.1158 0.7049
dipole: 1.8592
quadrupole: -48.6736 -61.4606 -56.8123
quadrupole: 5.5386 1.9112 -1.1630
quadrupole: 6.9753 -5.8118 -1.1635 5.5386 1.9112 -1.1630
hfenergy: -708.5743589 hartree
pointgroup: C01 [X(C6H12O1S1)]
dipole: -0.6623716 -0.3094302 -0.0240865 debye
dipolederiv: -0.3302222 0.0775668 -0.063894 0.0603537 -0.2236389 -0.0418831 -0.1424381 -0.0139103 -0.2047524 -0.4515238 0.0229174 -0.1463696 0.0563546 -0.3384559 -0.0701854 -0.0768316 -0.061481 -0.5555473 0.1463718 -0.0874937 0.0350901 -0.2148809 0.2380526 0.0705304 -0.0956299 -0.0080646 0.2962608 0.1647855 -0.0226301 0.0193153 0.0044434 0.2985691 0.0225357 0.1366105 0.0735476 0.0659212 0.3117941 0.0605463 -0.0415428 0.0634789 0.0605882 -0.0164508 -0.036083 -0.0143211 -0.0291338 0.2845995 -0.0296975 0.2279009 -0.0603593 0.1670953 0.0000301 0.3345098 -0.0225737 0.325607 -0.0199855 -0.0127656 -0.0469665 -0.0337274 -0.1044273 0.0367862 -0.0991776 0.0963004 -0.0285356 -0.0685444 -0.0753014 0.0006524 -0.0356959 -0.001806 0.0465615 -0.1542472 -0.012944 0.013152 0.0988092 0.0031184 0.0214654 0.0773593 -0.0837041 0.041157 0.0251747 0.0424565 0.0059425 -0.1333792 0.0506523 0.0553803 0.0812985 0.0171295 -0.0344101 0.0797371 -0.0364238 0.0943816 0.0235798 -0.0072818 0.0061175 -0.0727646 -0.1271248 -0.010241 -0.0283632 -0.0287729 0.1199477 -0.0435922 -0.0270145 -0.0635092 -0.00313 0.1037825 -0.0218971 -0.0423918 -0.0253971 -0.0611375 -0.0091935 -0.0291468 0.0424636 -0.0228702 -0.0955473 0.0339385 0.0684438 0.1114993 0.059559 -0.0082463 0.0498246 0.0214493 0.0622025 -0.008027 -0.0269798 0.007006 -0.0379861 -0.0636736 0.0236196 0.0234126 -0.1315639 0.0280256 0.0668887 0.0163487 -0.1453386 0.0244252 -0.1232842 -0.0747794 -0.1354429 0.0428037 -0.1130798 0.007241 0.0136928 0.0250806 -0.0027232 0.0986625 0.0118275 0.0905214 0.0693255 0.0555683 0.0213932 -0.0340997 0.121304 -0.0958686 0.0000878 -0.0313369 -0.0344365 -0.1053047 -0.0257272 0.1012485 0.0055572 -0.1400515 -0.0202336 -0.0969922 0.0958906 0.0460303 -0.0093515 0.005362 -0.1318677 0.0602358 0.0219593 0.0909955 0.0820053 0.0095257 0.0366207 0.0665383 0.0877885 0.0326105 -0.0912268 0.1407267 -0.0585246 0.0015292 unknown
polarizability: 104.9843762|7.6127819|68.2746845|0.9356578|-3.520609|80.004835 unknown
InChI: InChI=1S/C6H12OS/c1-5(2)8-4-6-3-7-6/h5-6H,3-4H2,1-2H3
charge 0 multiplicity 1
20 atoms
S  0.984103 0.071132 -1.590064
O  -1.279948 0.025592 1.197599
C  -1.548277 0.182159 -0.289775
C  -2.59415 -0.418061 0.604518
C  -0.711296 -0.675845 -1.209113
C  1.824023 0.032611 0.140993
C  2.032859 -1.407001 0.634419
C  3.145396 0.805096 -0.019631
H  -1.664092 1.231679 -0.591843
H  -3.462683 0.18327 0.899892
H  -2.747705 -1.505066 0.59448
H  -1.19428 -0.7649 -2.199186
H  -0.58102 -1.688247 -0.790489
H  1.140221 0.571749 0.81785
H  2.541356 -1.395731 1.618593
H  1.072047 -1.932851 0.769822
H  2.656924 -1.980113 -0.074764
H  3.673758 0.844852 0.951422
H  2.96981 1.840938 -0.35973
H  3.811056 0.307237 -0.748994
