program: Gaussian 09
title: 000241735
version: EM64L-G09RevD.01
frameworkgroup: C1[X(C13H11Cl2NO2S)]
method: RPBEPBE
basis: SDD
operation: Freq
keyword: #p
keyword: freq=noraman
keyword: PBEPBE/SDD
title: #p freq=noraman PBEPBE/SDD
converged: YES YES NO NO
title: Mulliken charges:
elementType: Cl Cl S O O N C C C C C C C C C C C C C H H H H H H H H H H H
charge: -0.045866 -0.043312 0.965807 -0.517910 -0.510461 -0.565806 -0.072255 0.552677 -0.257316 -0.215185 0.450157 -0.343616 -0.379594 -0.338421 -0.289719 -0.796457 -0.094065 -0.199058 -0.234305 0.308326 0.282924 0.286390 0.246644 0.248087 0.326569 0.231293 0.233253 0.245785 0.260895 0.264540
chargesum: 0.00000
title: Mulliken charges with hydrogens summed into heavy atoms:
elementType: Cl Cl S O O N C C C C C C C C C C C C C
charge: -0.045866 -0.043312 0.965807 -0.517910 -0.510461 -0.257480 -0.072255 0.552677 0.025608 0.071204 0.450157 -0.096972 -0.131507 -0.338421 0.036850 -0.086126 -0.094065 0.061836 0.030236
polarizability: 2.26149496e+02 -2.79074762e+01 1.98705669e+02 1.64331872e+01 4.00766473e-02 1.85932979e+02
1716.lowfreq: -5.2402 -0.0019 -0.0009 0.0019 4.5439 9.4663 13.0561 18.7167 43.0193
frequency: 12.1837 18.6027 42.9182 56.9616 70.8615 76.0856 90.4988 131.0611 138.3531 157.6992 185.6683 222.3877 236.0240 242.8496 288.4031 296.1998 304.6801 308.8817 345.5494 379.8942 400.2321 407.7676 434.7374 441.4615 469.5076 502.9640 513.6371 562.8093 578.6020 583.6955 620.1666 685.5737 703.1363 706.0734 767.5344 778.2309 798.6697 818.9989 826.9525 848.2293 884.9264 887.5039 934.3194 962.7926 963.8757 982.8039 988.4892 993.7457 1012.5457 1047.6837 1049.7989 1075.7947 1121.3830 1131.1120 1186.8342 1218.2928 1219.6338 1254.7626 1290.8988 1298.1712 1379.8240 1381.1600 1391.7297 1397.1731 1399.7741 1450.1194 1470.5637 1470.8984 1474.5437 1553.7001 1587.6831 1591.9180 1593.2151 2982.4623 3064.9866 3095.1035 3136.5994 3141.0754 3161.4014 3165.4937 3168.1377 3175.3709 3186.3964 3410.5370
redmass: 9.8105 6.3925 4.1209 1.0491 8.4594 5.4054 9.7832 6.1302 5.4038 17.7057 14.2304 7.5864 9.9137 6.6641 5.8484 4.6978 8.0349 16.1646 4.9070 3.7978 7.7019 2.8865 7.2695 3.5265 4.9508 3.2116 2.9177 6.1219 6.0051 6.2145 6.9506 5.6357 3.6243 4.1377 2.0867 3.4176 1.3747 7.1390 1.3938 1.2428 5.7881 1.5179 1.3448 2.4968 1.9652 1.4421 2.9241 1.8914 6.7183 2.4478 1.5957 1.9115 1.2893 1.4636 1.1338 2.3670 1.9531 1.9042 1.4254 1.2619 5.1208 5.5562 3.0170 3.5173 1.2414 2.6639 1.3455 1.6367 1.0777 6.4874 7.9097 6.3851 6.3573 1.0388 1.0952 1.0999 1.0890 1.0896 1.0960 1.0892 1.0962 1.0935 1.0975 1.0755
irintensity: 0.3971 0.8694 0.1925 0.5792 2.4583 0.2191 1.1598 1.0246 2.9148 0.2070 0.2605 8.3478 7.4664 1.0086 4.9647 0.5405 1.3748 0.6598 4.5410 0.6629 22.6000 0.0692 44.3376 80.6070 23.2474 87.2242 53.3379 11.2726 14.0635 31.2832 0.2553 1.0991 0.7461 4.0380 29.5404 17.7381 42.8554 197.9546 19.2787 0.1961 53.5983 35.9084 0.4271 27.0100 23.0281 3.3617 1.1740 2.9372 68.0247 24.9976 21.9905 34.7595 7.2272 5.3763 10.1829 5.6163 2.0280 17.6227 16.9992 3.0143 2.2512 1.4887 10.2952 21.4086 16.6591 110.0743 19.7180 17.4187 14.5767 18.9137 34.1864 7.9744 5.7430 20.1425 14.9550 13.5105 10.1001 6.7319 3.1661 0.6735 5.8646 4.8590 0.9096 40.2520
temp: 298.150 k
press: 1.00000 atm
elementType: 17 17 16 8 8 7 6 6 6 6 6 6 6 6 6 6 6 6 6 1 1 1 1 1 1 1 1 1 1 1
symmnumber: 1
zpe: 546633.5 jmol-1
zpe.correction: 0.208202 hartree
zpe.thermalcorrener: 0.227320 hartree
zpe.thermalcorrenthalpy: 0.228264 hartree
zpe.thermalcorrgfe: 0.157457 hartree
zpe.sumelectzpe: -2023.827569 hartree
zpe.sumelectthermal: -2023.808451 hartree
zpe.sumelectthermalent: -2023.807506 hartree
zpe.sumelectthermalfe: -2023.878314 hartree
dipole: 2.7335 4.6842 5.4321
dipole: 7.6760
quadrupole: -120.9407 -133.8749 -140.3860
quadrupole: 8.2939 1.8365 -5.0483
quadrupole: 10.7932 -2.1411 -8.6521 8.2939 1.8365 -5.0483
hfenergy: -2024.0357708 hartree
pointgroup: C01 [X(C13H11Cl2N1O2S1)]
dipole: 1.2518287 2.6280117 0.8042028 debye
polarizability: 222.7027796|-16.2670042|197.1340365|29.2380757|-8.2655924|190.9513277 unknown
InChI: InChI=1S/C13H11Cl2NO2S/c1-9-2-5-11(6-3-9)19(17,18)16-13-8-10(14)4-7-12(13)15/h2-8,16H,1H3
charge 0 multiplicity 1
30 atoms
Cl -0.934164 0.082415 3.328134
Cl -4.040301 1.193405 -2.187412
S  0.386272 -2.192884 -0.373157
O  1.13831 -3.434998 0.348102
O  -0.324642 -2.297462 -1.82507
N  -1.020276 -1.787384 0.867974
C  1.552264 -0.706922 -0.412809
C  -1.728157 -0.579593 0.716663
C  2.580796 -0.650555 0.54308
C  1.34912 0.273102 -1.397149
C  3.285828 1.488729 -0.466684
C  3.447996 0.461421 0.502942
C  2.230832 1.377032 -1.410212
C  -1.825167 0.386322 1.760708
C  -2.431294 -0.320117 -0.497181
C  4.244476 2.66373 -0.507849
C  -3.165157 0.86823 -0.623926
C  -2.599568 1.550555 1.634186
C  -3.275346 1.810448 0.42041
H  -0.62274 -1.961194 1.8069
H  2.713506 -1.456974 1.271574
H  0.549082 0.165541 -2.136223
H  4.262557 0.531131 1.232952
H  2.096523 2.158136 -2.166775
H  -2.389742 -1.062225 -1.299243
H  3.814084 3.521713 -1.051252
H  4.515561 3.000754 0.508114
H  5.184885 2.384132 -1.020688
H  -2.666956 2.25826 2.465106
H  -3.871983 2.717754 0.298685
