program: Gaussian 09
title: 000241712
version: EM64L-G09RevD.01
frameworkgroup: C1[X(C4H6Cl2N2O2)]
method: RPBEPBE
basis: SDD
operation: Freq
keyword: #p
keyword: freq=noraman
keyword: PBEPBE/SDD
title: #p freq=noraman PBEPBE/SDD
converged: YES YES NO NO
title: Mulliken charges:
elementType: Cl Cl O O N N C C C C H H H H H H
charge: -0.051654 -0.051649 -0.278175 -0.278180 -0.298365 -0.298363 0.306188 0.306194 -0.652232 -0.652242 0.372555 0.372550 0.300840 0.300846 0.300832 0.300854
chargesum: 0.00000
title: Mulliken charges with hydrogens summed into heavy atoms:
elementType: Cl Cl O O N N C C C C
charge: -0.051654 -0.051649 -0.278175 -0.278180 0.074190 0.074187 0.306188 0.306194 -0.050546 -0.050556
polarizability: 1.11113576e+02 1.33121022e+00 1.03904046e+02 -3.11286015e-03 2.43634944e-04 4.09980146e+01
1716.lowfreq: -9.6492 -0.0026 -0.0007 -0.0006 5.0958 7.3697 30.0973 63.3183 71.1219
frequency: 30.0973 63.3149 71.1219 85.0235 99.9484 123.7042 250.0399 260.5862 280.4228 369.6568 393.0383 543.6386 557.7750 565.8442 647.4457 676.3020 685.6083 698.8559 704.6143 898.7145 906.5084 907.6102 1006.0912 1152.7710 1155.1533 1161.0138 1215.9732 1258.6134 1261.3095 1266.0253 1421.4683 1425.1068 1449.6284 1537.8511 1554.9055 1619.9602 3068.5436 3068.5495 3147.6560 3147.6814 3466.6759 3478.1416
redmass: 10.8472 3.2543 13.6805 7.0991 2.8290 25.1578 9.3578 10.2914 4.1079 12.8843 12.3058 3.4320 5.4543 3.7894 5.6600 1.0768 1.1201 6.2462 6.1382 6.1428 1.6693 1.6701 3.9404 1.1066 1.1114 9.8860 1.4630 1.3107 1.1929 1.8443 1.2059 1.0876 2.7355 2.3225 10.5856 10.3646 1.0567 1.0567 1.1089 1.1089 1.0817 1.0783
irintensity: 1.2585 0.0000 1.0392 5.2546 30.1809 0.0002 57.1489 0.0000 0.0001 0.0000 26.3505 5.5529 0.0001 0.0001 17.4103 226.8015 0.0013 107.9248 0.0008 4.2397 22.7664 0.0002 0.0000 0.8620 0.0001 0.0000 26.9520 0.0002 28.7437 0.0000 219.9692 0.0002 324.1140 0.0002 562.5540 0.0001 0.9830 6.5836 0.1062 0.9672 0.0010 162.0001
temp: 298.150 k
press: 1.00000 atm
elementType: 17 17 8 8 7 7 6 6 6 6 1 1 1 1 1 1
symmnumber: 1
zpe: 285207.6 jmol-1
zpe.correction: 0.108630 hartree
zpe.thermalcorrener: 0.119687 hartree
zpe.thermalcorrenthalpy: 0.120631 hartree
zpe.thermalcorrgfe: 0.068970 hartree
zpe.sumelectzpe: -1335.317726 hartree
zpe.sumelectthermal: -1335.306669 hartree
zpe.sumelectthermalent: -1335.305725 hartree
zpe.sumelectthermalfe: -1335.357385 hartree
dipole: 0.0001 0.0001 0.0030
dipole: 0.0030
quadrupole: -66.3638 -84.9751 -70.7777
quadrupole: 7.7517 -0.0133 -0.0051
quadrupole: 7.6751 -10.9363 3.2612 7.7517 -0.0133 -0.0051
hfenergy: -1335.4263555 hartree
pointgroup: C01 [X(C4H6Cl2N2O2)]
dipole: 0.0000511 0.0000319 -0.0011873 debye
dipolederiv: -0.2622041 -0.0330987 -0.0007188 -0.2185912 -0.5546158 -0.0107186 -0.005512 -0.0108669 -0.1435084 -0.2622156 -0.0331296 -0.0009318 -0.2186059 -0.5545822 -0.0113518 -0.0060543 -0.011321 -0.1435334 -0.6801254 -0.2200437 -0.0054376 0.5045461 -0.9921059 -0.0176159 0.0144606 -0.0167983 -0.3657559 -0.6801315 -0.2200321 -0.0060997 0.5045154 -0.99203 -0.0184221 0.0146602 -0.018395 -0.3658218 -0.8531043 0.2874118 0.0088021 0.4783676 -0.4575714 -0.0054273 0.014746 -0.0059485 -0.2611211 -0.8530884 0.2873965 0.0089167 0.4783979 -0.4575361 -0.0064607 0.0137268 -0.0057489 -0.2611423 1.3887723 -0.0128974 -0.0025189 -0.9257992 1.0766418 0.0248273 -0.0276419 0.0238901 0.2028141 1.3888004 -0.0129233 -0.0011832 -0.9257995 1.0765411 0.0263087 -0.0269348 0.0258623 0.202912 -0.0438967 -0.1140176 -0.0026294 0.1835251 0.7014241 0.014417 0.0050022 0.0151581 0.1490434 -0.0438858 -0.1139482 -0.0031975 0.183589 0.7014138 0.0150061 0.0051193 0.0149742 0.149045 0.3305917 0.1063266 0.0028679 -0.012359 0.261198 -0.002554 -0.0003905 -0.0027842 0.3494988 0.3305575 0.1063091 0.0029249 -0.0123859 0.2611642 -0.0024421 -0.0005956 -0.0024136 0.3495153 0.0596606 -0.0054993 -0.0492141 -0.0027029 -0.0190404 0.0389584 -0.0782221 0.0160479 0.0362512 0.0603087 -0.0081701 0.0487114 -0.0069802 -0.0159223 -0.0416927 0.077794 -0.0189249 0.0327774 0.0599915 -0.0054892 -0.0491132 -0.0027712 -0.0190493 0.0389203 -0.0780924 0.0161355 0.0360048 0.059969 -0.0081949 0.0488212 -0.006946 -0.0159295 -0.0417526 0.0779345 -0.0188669 0.0330208 unknown
polarizability: 110.9169584|1.7761626|104.05262|-0.0184927|1.7393373|41.0460586 unknown
InChI: InChI=1S/C4H6Cl2N2O2/c5-1-3(9)7-8-4(10)2-6/h7-8H,1-2H2
charge 0 multiplicity 1
16 atoms
Cl 2.941751 2.207197 0.377751
Cl -2.938542 -2.227263 0.261959
O  1.753803 -1.68872 0.274905
O  -1.750346 1.668427 0.372175
N  0.614698 0.324683 0.33175
N  -0.611277 -0.344933 0.313399
C  1.766651 -0.416213 0.309395
C  -1.763229 0.395992 0.334924
C  3.094651 0.3258 0.327366
C  -3.09126 -0.345904 0.313763
H  0.558563 1.350556 0.361633
H  -0.555141 -1.370858 0.285162
H  3.668003 0.036079 1.22007
H  3.665119 0.084621 -0.581541
H  -3.662681 -0.055665 -0.580089
H  -3.663662 -0.1051 1.221477
