program: Gaussian 09
title: 000241765
version: EM64L-G09RevD.01
frameworkgroup: C1[X(C22H32O4)]
method: RPBEPBE
basis: SDD
operation: Freq
keyword: #pfreq=noraman
keyword: PBEPBE/SDD
title: #p freq=noraman PBEPBE/SDD
converged: NO YES NO NO
title: Mulliken charges:
elementType: O O O O C C C C C C C C C C C C C C C C C C C C C C H H H H H H H H H H H H H H H H H H H H H H H H H H H H H H H H
charge: -0.451927 -0.272811 -0.234818 -0.244535 0.394032 -0.160169 -0.126642 -0.195893 0.219547 -0.598463 0.200729 -0.122770 -0.549216 -0.491236 -0.489975 -0.799998 0.545274 -0.641636 -0.451007 -0.817167 -0.809002 -0.570510 -0.589287 0.178542 0.283951 -0.769222 0.217261 0.239221 0.233816 0.235743 0.232791 0.275657 0.221201 0.220735 0.249747 0.214637 0.233640 0.220976 0.212225 0.239124 0.228244 0.224741 0.236504 0.231731 0.214837 0.246226 0.225907 0.216834 0.236411 0.218796 0.234859 0.326997 0.242798 0.231098 0.254493 0.251505 0.247796 0.247657
chargesum: 0.00000
title: Mulliken charges with hydrogens summed into heavy atoms:
elementType: O O O O C C C C C C C C C C C C C C C C C C C C C C
charge: -0.124930 -0.272811 -0.234818 -0.244535 0.394032 0.057092 0.112579 0.037923 0.219547 -0.129930 0.200729 0.152887 -0.107280 -0.026852 -0.035358 -0.120404 0.545274 -0.180391 -0.004439 -0.128199 -0.118935 -0.096614 -0.334794 0.178542 0.283951 -0.022265
polarizability: 2.95099500e+02 -6.97231136e+00 2.42050821e+02 1.32267487e+01 2.89104283e+00 1.89287127e+02
1716.lowfreq: -4.6449 -0.5370 -0.0003 -0.0002 0.0005 12.1360 13.5996 23.5261 27.3944
frequency: 11.5804 23.0478 27.3052 43.4818 62.1612 73.9461 82.6982 90.9814 123.8258 147.7897 169.1929 176.9809 185.7294 195.9069 206.9492 213.1942 223.4997 245.2497 255.2833 262.1229 275.7019 284.4043 293.9277 306.5851 317.4510 331.0160 340.7354 360.3124 374.1685 381.8643 405.4421 413.5180 435.2248 448.7851 458.3231 484.3098 490.3870 497.4216 527.0915 542.7461 555.7371 561.5585 569.9857 592.1772 616.6546 622.9984 646.7027 676.6404 719.2188 734.7308 778.8533 788.6433 820.7406 832.9089 834.2767 851.2600 865.8835 886.5377 902.5407 910.6286 918.1607 922.7825 928.0755 942.9588 945.9777 964.7679 982.6734 983.1560 995.6247 1003.1041 1008.8188 1025.1468 1037.6561 1039.2389 1052.2593 1065.7569 1069.7775 1075.5554 1089.4445 1110.0918 1112.4599 1117.3834 1121.3597 1130.0358 1144.2002 1159.6234 1172.7458 1183.4665 1188.6151 1198.0082 1206.7578 1210.7547 1221.6962 1234.3676 1240.3536 1245.6885 1267.5608 1274.5201 1276.9269 1280.2291 1281.7443 1293.9817 1302.4209 1312.4689 1316.7655 1322.6105 1324.6104 1329.1169 1337.8087 1344.1786 1349.1942 1350.9199 1353.3417 1364.9125 1382.6289 1390.9530 1395.3314 1402.9305 1441.9540 1452.0741 1453.6825 1458.0690 1460.1093 1461.5698 1467.0487 1469.9987 1470.7683 1472.4237 1481.0389 1483.5549 1486.5341 1487.7335 1489.6951 1586.9070 1625.0729 1639.4990 2924.9765 2946.7054 2952.6229 2967.9469 2974.1339 2977.3112 2979.2995 2980.9026 2988.1011 2989.9111 2998.2854 3001.7527 3005.3995 3016.4441 3036.3828 3039.4010 3043.7161 3051.8141 3056.6932 3060.1642 3064.3392 3069.4269 3077.3630 3081.7965 3083.2925 3084.9952 3085.5604 3092.8118 3095.7349 3117.4346 3141.4515 3539.8510
redmass: 3.9047 8.5321 1.2383 4.7215 3.2871 2.6324 2.1471 4.0041 4.9674 2.6532 2.0876 1.8482 3.7135 4.1212 2.0789 1.4291 2.2556 2.9053 2.4833 2.4744 2.8867 1.4290 2.1667 1.3800 2.9761 2.2790 2.7192 2.9977 3.0204 2.5910 2.9014 3.4867 3.0679 3.2922 3.6671 3.2872 3.4845 3.6475 2.6437 3.0466 2.9736 3.0526 3.1113 3.1702 3.6631 4.5241 3.7154 3.3359 3.4368 2.8809 2.0477 1.6115 3.2744 2.5345 2.0533 2.7968 2.2305 1.4255 2.4531 2.7819 2.2967 2.3930 1.9225 1.7318 1.9417 2.3527 1.8736 2.6155 1.8927 2.2446 2.1257 1.9771 1.7558 1.7013 1.9013 2.0469 2.3063 2.0482 1.8345 2.3959 2.3623 1.8340 2.0937 2.5173 1.6359 2.2272 1.7331 1.6209 1.8663 2.2064 3.1602 1.8473 1.4528 1.3724 1.7274 1.5434 1.5225 1.4753 1.3637 1.5648 1.6688 1.4537 1.4200 1.3422 1.5634 1.4622 1.7718 1.5090 1.5519 1.6846 1.4166 1.4492 1.4714 1.5300 1.2495 1.2011 1.2126 1.1905 1.0791 1.0618 1.0548 1.0802 1.0744 1.0833 1.0771 1.0882 1.0584 1.0584 1.0569 1.0581 1.0767 1.0569 1.0643 10.0210 7.7280 9.0557 1.0807 1.0813 1.0664 1.0680 1.0386 1.0652 1.0625 1.0687 1.0389 1.0614 1.0378 1.0619 1.0373 1.0642 1.0952 1.0929 1.1007 1.0989 1.0907 1.0938 1.0979 1.1013 1.0986 1.1020 1.0999 1.0985 1.0981 1.0969 1.0984 1.0910 1.1010 1.0657
irintensity: 0.9808 0.5211 2.8349 3.9698 0.5782 1.9409 0.4768 0.6059 0.2972 1.9891 1.2129 2.5690 1.1345 3.0133 2.5209 7.1122 4.9445 3.7450 0.6188 7.6017 2.2746 24.0476 55.8124 36.0486 1.6961 13.8479 3.0679 5.9937 6.5651 1.3277 1.6937 1.8282 0.5912 1.7721 10.4294 7.2407 7.7018 6.9243 0.2576 3.6892 1.1011 4.7134 0.6065 5.7736 1.4703 2.9938 0.7672 7.6464 0.8665 1.2915 4.6658 5.3696 4.8974 1.7525 0.0408 3.6499 0.3691 16.2626 50.3679 21.1020 22.4251 50.4841 14.8076 7.0597 9.4101 4.6584 2.1801 1.7380 86.4278 6.3031 2.2738 1.9509 3.4602 9.1465 8.4430 0.9529 43.6344 5.9515 57.0261 8.8381 1.4852 0.7840 4.7903 28.1511 23.9744 3.1251 0.5983 29.2400 1.4469 84.5171 259.8994 1.0799 6.6923 7.6203 50.9700 3.1087 0.6644 0.8788 21.7985 29.9049 17.6465 3.4607 1.5238 3.4573 7.4062 5.0251 9.2737 12.6296 3.1242 4.4823 1.2190 2.8306 4.0620 1.5488 65.0443 31.3373 8.4977 22.6534 15.3199 18.9892 18.4971 10.7583 5.6510 25.1995 8.4899 8.2174 7.0186 6.4882 7.8990 6.1011 4.6984 8.5291 8.8611 157.2547 202.5892 156.5996 12.8200 5.9309 15.2010 12.5073 10.2905 13.0873 20.6590 34.4545 30.3178 37.4612 28.8946 29.5178 2.1670 32.8339 10.2622 39.3083 34.5819 23.4229 22.4067 22.0333 21.7108 24.2905 38.1633 33.4392 35.7595 29.9941 34.8823 8.0559 24.6318 11.3399 10.2874 4.3840
temp: 298.150 k
press: 1.00000 atm
elementType: 8 8 8 8 6 6 6 6 6 6 6 6 6 6 6 6 6 6 6 6 6 6 6 6 6 6 1 1 1 1 1 1 1 1 1 1 1 1 1 1 1 1 1 1 1 1 1 1 1 1 1 1 1 1 1 1 1 1
symmnumber: 1
zpe: 1305583.2 jmol-1
zpe.correction: 0.497270 hartree
zpe.thermalcorrener: 0.523380 hartree
zpe.thermalcorrenthalpy: 0.524324 hartree
zpe.thermalcorrgfe: 0.440829 hartree
zpe.sumelectzpe: -1156.429872 hartree
zpe.sumelectthermal: -1156.403762 hartree
zpe.sumelectthermalent: -1156.402818 hartree
zpe.sumelectthermalfe: -1156.486313 hartree
dipole: 3.7903 -0.2431 -0.8540
dipole: 3.8929
quadrupole: -202.6753 -149.1720 -159.1681
quadrupole: -6.4990 -15.9611 -10.3922
quadrupole: -32.3368 21.1665 11.1703 -6.4990 -15.9611 -10.3922
hfenergy: -1156.9271426 hartree
pointgroup: C01 [X(C22H32O4)]
dipole: -1.4647147 0.3052535 -0.3273897 debye
polarizability: 292.3059404|-13.3447817|244.8734862|-13.8632524|0.6465085|189.2580209 unknown
InChI: InChI=1S/C22H32O4/c1-13(23)26-18-12-21(3)17(8-10-22(21,4)25)16-6-5-14-11-15(24)7-9-20(14,2)19(16)18/h11,16-19,25H,5-10,12H2,1-4H3
charge 0 multiplicity 1
58 atoms
O  -5.181048 0.187159 0.438466
O  0.016405 -2.250984 -0.664581
O  5.92418 0.120515 -0.969618
O  -0.539896 -3.739232 1.047983
C  -2.633531 0.341739 0.226714
C  -1.765826 1.521204 -0.303772
C  -0.321072 1.48999 0.231597
C  0.391787 0.141628 -0.151413
C  -4.054615 0.725823 -0.361226
C  -1.99003 -0.958208 -0.294312
C  1.858162 0.056068 0.476472
C  -0.510744 -1.091691 0.146979
C  -2.63015 2.778818 -0.026012
C  -4.104457 2.279432 -0.182597
C  0.503226 2.679493 -0.304691
C  -2.728876 0.308241 1.776259
C  2.629848 1.33364 0.076145
C  1.935013 2.667417 0.27375
C  2.612256 -1.200105 -0.068292
C  -4.266249 0.302449 -1.830873
C  1.809848 -0.017304 2.037628
C  4.142488 -1.159296 0.128824
C  3.915914 1.309752 -0.402567
C  4.752921 0.097171 -0.48025
C  -0.089729 -3.525418 -0.102506
C  0.409545 -4.572604 -1.074498
H  -1.696147 1.399969 -1.408863
H  -0.363048 1.58373 1.336136
H  0.526585 0.164174 -1.256358
H  -2.004244 -0.972417 -1.40064
H  -2.530233 -1.858178 0.060953
H  -0.461163 -1.389706 1.208831
H  -2.398433 3.607145 -0.718229
H  -2.447021 3.153896 0.999149
H  -4.712392 2.501953 0.710805
H  -4.609508 2.750688 -1.044226
H  0.006945 3.631618 -0.039212
H  0.545082 2.630183 -1.412236
H  -1.739605 0.191136 2.252422
H  -3.198739 1.221147 2.178839
H  -3.35651 -0.540228 2.098184
H  1.867905 2.877095 1.363171
H  2.545269 3.477803 -0.164483
H  2.394056 -1.306058 -1.147691
H  2.216544 -2.103547 0.42565
H  -5.252966 0.663878 -2.170267
H  -3.498321 0.726648 -2.502326
H  -4.245883 -0.798193 -1.948084
H  2.832641 -0.044677 2.453191
H  1.297328 0.850392 2.487001
H  1.291358 -0.933277 2.374063
H  -5.262322 -0.785382 0.261137
H  4.626001 -2.045494 -0.319138
H  4.401793 -1.170579 1.207721
H  4.407127 2.243351 -0.707688
H  1.401632 -4.292499 -1.467697
H  -0.276329 -4.640893 -1.937743
H  0.462731 -5.550171 -0.574181
