program: Gaussian 09
title: 000241688
version: EM64L-G09RevD.01
frameworkgroup: C1[X(C6H12O3S3)]
method: RPBEPBE
basis: SDD
operation: Freq
keyword: #p
keyword: freq=noraman
keyword: PBEPBE/SDD
title: #p freq=noraman PBEPBE/SDD
converged: YES YES NO NO
title: Mulliken charges:
elementType: S S S O O O C C C C C C H H H H H H H H H H H H
charge: 0.674682 0.674970 0.674833 -0.591272 -0.591282 -0.591294 -0.541491 -0.540796 -0.541307 -0.652399 -0.652392 -0.652358 0.326274 0.325371 0.326188 0.275009 0.234198 0.274906 0.234245 0.274939 0.274946 0.274963 0.274881 0.234185
chargesum: 0.00000
title: Mulliken charges with hydrogens summed into heavy atoms:
elementType: S S S O O O C C C C C C
charge: 0.674682 0.674970 0.674833 -0.591272 -0.591282 -0.591294 -0.215217 -0.215425 -0.215119 0.131715 0.131738 0.131671
polarizability: 1.76285416e+02 7.88908889e-03 1.76285233e+02 2.93021612e-03 5.97152446e-02 8.64526106e+01
1716.lowfreq: -10.1257 -2.4220 0.0015 0.0018 0.0030 14.8911 56.3734 56.7673 91.4303
frequency: 56.2141 56.7417 91.4204 153.4649 155.0258 156.2090 171.2496 180.3327 180.9406 209.2791 212.5533 236.2772 241.2545 242.3626 259.6563 260.2014 261.2251 350.8410 375.7734 376.8937 389.1356 480.8949 512.7278 513.5161 577.8258 578.8767 621.4489 784.7930 785.0760 794.3258 966.0666 967.1585 983.7106 1003.0915 1028.5173 1029.0353 1070.2402 1071.1588 1080.7585 1105.4380 1134.4244 1135.8690 1227.3635 1228.4841 1264.4127 1385.8803 1387.6773 1389.2776 1458.3356 1459.3031 1459.7795 1464.7964 1465.1607 1465.7007 2986.5766 2987.0406 2987.1793 3055.3849 3057.1349 3058.9360 3090.3192 3090.6221 3091.1815 3091.8162 3092.4026 3092.8057
redmass: 4.8704 4.8264 5.8734 4.4832 5.0447 4.7051 2.8628 8.7793 8.8112 1.7809 1.9106 1.2532 2.0225 1.9883 2.8740 13.2665 2.6869 4.7611 4.3923 4.3592 4.7611 5.2192 4.7165 4.7128 5.1779 5.1689 4.4550 16.3853 16.4427 19.0386 1.2331 1.2425 1.3479 1.2006 1.3751 1.3797 3.6429 3.6228 1.2815 4.0889 1.2755 1.2711 1.2736 1.2714 1.2530 1.1751 1.1748 1.1769 1.0426 1.0425 1.0422 1.0509 1.0507 1.0501 1.0350 1.0350 1.0350 1.0882 1.0877 1.0877 1.0994 1.0993 1.0994 1.0998 1.1000 1.1000
irintensity: 0.3163 0.1015 22.9767 11.3515 14.0323 13.5075 0.0258 2.7024 2.9422 9.8809 9.6911 0.1074 0.0225 0.2844 16.5823 0.4663 15.8104 0.0058 2.6231 2.4904 1.2874 0.0084 25.0238 25.1452 5.0142 4.9647 12.3094 59.6199 59.6500 0.0650 5.8850 5.9679 17.7491 0.0273 3.8428 3.9637 3.2701 3.1987 0.0940 1.1010 35.0248 35.4697 4.6384 4.8319 0.3553 51.5057 49.4524 19.9561 7.4629 11.2844 14.5764 8.5578 17.7300 40.5802 4.9569 5.1205 4.0845 1.2703 1.0039 0.9891 0.4001 0.1043 0.7464 16.8908 8.3750 3.4377
temp: 298.150 k
press: 1.00000 atm
elementType: 16 16 16 8 8 8 6 6 6 6 6 6 1 1 1 1 1 1 1 1 1 1 1 1
symmnumber: 1
zpe: 455655.1 jmol-1
zpe.correction: 0.173550 hartree
zpe.thermalcorrener: 0.189708 hartree
zpe.thermalcorrenthalpy: 0.190652 hartree
zpe.thermalcorrgfe: 0.130871 hartree
zpe.sumelectzpe: -1654.473456 hartree
zpe.sumelectthermal: -1654.457298 hartree
zpe.sumelectthermalent: -1654.456354 hartree
zpe.sumelectthermalfe: -1654.516135 hartree
dipole: 0.0001 0.0101 -1.5023
dipole: 1.5023
quadrupole: -109.3581 -109.3532 -92.8454
quadrupole: -0.0002 -0.0076 -0.1381
quadrupole: -5.5058 -5.5010 11.0068 -0.0002 -0.0076 -0.1381
hfenergy: -1654.647006 hartree
pointgroup: C01 [X(C6H12O3S3)]
dipole: -0.0037814 -0.0035036 0.5910335 debye
dipolederiv: 0.7648059 -0.1216249 0.2195962 -0.1210837 0.3506417 -0.0588635 0.2763784 -0.0751688 0.2155299 0.5631482 0.2408984 -0.1573176 0.2407601 0.5599389 -0.156029 -0.1986945 -0.197074 0.2130198 0.348601 -0.1183666 -0.05718 -0.1184036 0.7665052 0.219978 -0.0734187 0.276635 0.2151614 -0.8257778 0.0972894 -0.1987895 0.0970563 -0.4929879 0.0535281 0.163422 -0.0442655 -0.3335063 -0.6611628 -0.192327 0.1433566 -0.1921413 -0.6586379 0.1422645 -0.1238038 -0.1229824 -0.3330793 -0.4916996 0.0946694 0.052031 0.094745 -0.8273423 -0.1992881 -0.0429955 0.1637355 -0.3333787 0.0149146 -0.0689861 -0.0269815 -0.0688113 0.2550195 0.1008372 -0.0376436 0.1453604 -0.0028962 0.1359973 0.1385498 -0.0754086 0.1384242 0.1337799 -0.0749327 -0.107384 -0.1064469 -0.0021336 0.2539944 -0.0703464 0.1006788 -0.0710753 0.0160726 -0.0279764 0.1448986 -0.0387248 -0.0028348 -0.2139813 -0.0004859 0.0093882 -0.0020159 -0.2056923 -0.0380351 0.0440467 -0.1725594 0.041725 -0.2094498 0.0050918 0.0286848 0.0050208 -0.2095224 0.028511 0.1271181 0.1261599 0.0407257 -0.2055119 -0.0020518 -0.0379585 -0.0002849 -0.2140878 0.0095896 -0.1721399 0.045407 0.0417585 -0.0862349 -0.0157205 -0.0195163 -0.0158115 -0.0309297 0.0739874 -0.0092753 0.0343267 -0.0204011 -0.058615 0.0315051 -0.0541826 0.0314781 -0.0590445 -0.0539121 -0.0249198 -0.0247854 -0.0211796 -0.0311219 -0.016409 0.0736489 -0.0160756 -0.0859815 -0.019927 0.0343375 -0.0095238 -0.0204513 0.0067652 0.0658123 0.0695044 0.0246653 0.1161201 0.0105546 0.0444365 0.0231553 0.0961611 0.1200454 0.0042453 0.0010965 0.0051062 0.1012938 0.0011146 -0.0201898 0.0814099 -0.0900376 0.0735679 -0.0902314 -0.0664528 -0.0492603 0.0501173 -0.0258114 -0.0503605 -0.0029968 0.0943702 0.1103596 -0.0107794 -0.0012493 -0.0105607 0.1107301 -0.0010411 -0.060153 -0.0596617 -0.0892415 -0.003881 0.0048081 0.0555502 0.0452063 0.1274115 -0.0445543 0.0271382 -0.0424437 0.0951979 0.1279158 0.0444183 -0.0440905 0.0039224 -0.0041612 0.0558244 -0.0423261 0.0273663 0.0951285 0.1167414 0.0238383 0.0108829 0.0648519 0.0061666 0.0694038 0.0235147 0.0442401 0.0960771 0.049244 -0.0490485 -0.0263906 -0.0901744 0.0745979 -0.0662006 -0.0032545 -0.0503228 0.09437 0.1013354 0.0052513 0.0010995 0.0044618 0.1199924 0.000978 0.0812681 -0.0208402 -0.0900851 unknown
polarizability: 176.2771675|0.0004728|176.2928786|0.1710273|0.1688169|86.4532137 unknown
InChI: InChI=1S/C6H12O3S3/c1-4-10(7)5(2)12(9)6(3)11(4)8/h4-6H,1-3H3
charge 0 multiplicity 1
24 atoms
S  1.802108 -0.489755 0.620625
S  -1.328951 -1.319571 0.608923
S  -0.476943 1.805687 0.620778
O  3.161767 -0.858482 -0.29052
O  -2.321788 -2.305284 -0.31697
O  -0.835607 3.167987 -0.290435
C  0.429825 -1.623439 -0.20491
C  1.189402 1.18114 -0.204793
C  -1.620283 0.441518 -0.204976
C  0.816007 -3.084013 -0.056745
C  2.261922 2.245802 -0.06524
C  -3.078066 0.838129 -0.057035
H  0.349067 -1.301382 -1.25818
H  0.948863 0.942611 -1.255924
H  -1.298557 0.35854 -1.258202
H  1.792731 -3.252889 -0.544899
H  0.891797 -3.398164 0.999811
H  0.058215 -3.713045 -0.557437
H  2.495983 2.477831 0.989324
H  3.185399 1.898134 -0.562241
H  1.920961 3.171958 -0.561898
H  -3.23996 1.815892 -0.545488
H  -3.712456 0.084693 -0.557544
H  -3.391736 0.916503 0.999475
