program: Gaussian 09
title: 000241664
version: EM64L-G09RevD.01
frameworkgroup: C1[X(C12H14N4O4S2)]
method: RPBEPBE
basis: SDD
operation: Freq
keyword: #p
keyword: freq=noraman
keyword: PBEPBE/SDD
title: #p freq=noraman PBEPBE/SDD
converged: YES YES NO NO
title: Mulliken charges:
elementType: S S O O O O N N N N C C C C C C C C C C C C H H H H H H H H H H H H H H
charge: 0.180033 0.179967 -0.252218 -0.252224 -0.261831 -0.261752 -0.454709 -0.454704 -0.573454 -0.573439 0.543795 0.543920 -0.710163 -0.395575 -0.395571 -0.188136 0.253858 0.253982 -0.820099 -0.820167 0.024168 0.024076 0.247037 0.305999 0.306004 0.224181 0.367276 0.367261 0.301810 0.300499 0.301858 0.300347 0.345177 0.348816 0.348815 0.345164
chargesum: 0.00000
title: Mulliken charges with hydrogens summed into heavy atoms:
elementType: S S O O O O N N N N C C C C C C C C C C C C
charge: 0.180033 0.179967 -0.252218 -0.252224 -0.261831 -0.261752 -0.087432 -0.087443 0.120539 0.120539 0.543795 0.543920 -0.463125 -0.089577 -0.089568 0.036045 0.253858 0.253982 -0.217791 -0.217962 0.024168 0.024076
polarizability: 2.97245313e+02 -4.07737355e-02 2.28935664e+02 1.05893999e+01 -6.08495500e-03 1.36314864e+02
1716.lowfreq: -4.5458 0.0009 0.0015 0.0020 1.7630 6.9487 15.4723 26.6491 32.0205
frequency: 15.4654 26.6100 32.0200 42.8869 55.6090 66.2953 67.0296 79.6229 92.9633 111.1882 133.0311 161.9321 164.2473 179.2528 194.4649 219.2524 247.7491 276.7383 285.8457 333.1394 345.0434 390.1891 391.1254 405.5681 443.0176 443.3239 461.6119 472.8980 473.0475 493.0754 498.4072 548.8211 549.2386 576.9144 582.8703 614.8704 615.4109 626.1826 644.5534 644.5705 657.5151 702.6216 712.7732 736.3243 741.0832 791.9950 818.6219 841.4852 858.4915 870.9118 896.8250 908.3072 914.7059 926.9656 938.9205 983.0005 1002.8687 1007.1030 1061.3414 1061.4610 1095.9205 1142.6566 1146.0666 1182.4081 1206.8227 1241.4366 1244.3680 1246.4706 1253.1317 1277.8182 1278.6748 1320.2726 1320.3798 1391.4915 1407.5787 1413.5106 1414.6789 1488.1098 1553.5271 1555.6060 1592.3366 1592.5398 1611.4398 1618.7440 1624.9664 1625.0524 1653.6188 1654.9407 3043.3062 3043.3195 3113.8609 3140.8616 3143.7565 3143.7793 3198.2391 3202.0522 3313.9131 3316.1276 3521.5917 3521.6843 3673.3760 3673.4539
redmass: 7.1590 7.2200 6.9889 4.6632 10.6494 10.2601 7.0458 8.1496 6.4448 7.8019 5.9785 7.4997 7.9050 7.5157 5.5281 4.0126 8.4113 4.6305 5.1848 3.3486 3.6664 3.7672 3.6847 5.8861 7.9734 7.8680 3.1550 1.2924 1.3116 3.7665 4.4269 1.2602 1.2613 7.0915 6.2935 3.8807 3.8568 5.0455 4.0201 3.9652 6.6098 2.0478 5.6338 6.1967 6.4032 4.6334 1.2703 1.6694 1.9435 1.1799 2.0729 2.5443 1.6130 6.5230 1.3632 6.2642 1.3098 3.3693 2.0321 2.0337 1.5769 1.2918 1.2459 1.1142 1.6188 2.2319 1.2820 1.3943 1.9175 2.9418 3.1477 1.4393 3.2453 9.1606 2.3457 1.1109 1.1818 2.9610 1.8974 2.7547 1.6778 1.7095 6.1993 5.0814 2.7246 2.3035 3.3376 3.2129 1.0607 1.0607 1.0918 1.0900 1.1043 1.1043 1.0929 1.0966 1.0818 1.0816 1.0449 1.0449 1.1051 1.1051
irintensity: 1.1238 0.4658 0.7064 5.4868 1.6057 5.6759 6.1817 1.8608 11.5031 2.3792 9.1118 6.5905 0.7537 5.9718 9.8726 33.1731 2.0814 0.6480 4.3172 4.1877 2.4185 0.2419 6.0454 4.6780 1.5376 0.1835 4.3068 2.4951 4.7191 27.6789 5.3406 205.4185 317.1209 18.8678 3.7247 29.2780 68.1030 0.1032 79.1814 54.9009 11.1167 18.1238 7.2005 4.6298 8.6548 2.3786 97.1422 18.7980 11.5190 5.4327 1.0124 60.8213 168.6605 0.0171 0.0801 0.2074 6.9993 2.4968 4.5594 10.0863 22.5324 44.8801 2.5869 5.9626 7.6580 54.6353 7.8450 4.6696 16.8258 103.7641 328.2077 81.0196 0.4387 87.4345 0.4916 67.4804 6.0913 406.6437 702.2772 89.0130 10.5166 25.6563 67.7597 311.6209 263.8170 354.5073 349.8815 5.5020 7.4551 4.7785 5.3981 20.3817 0.0392 0.0295 11.8708 0.5498 136.0681 411.3691 73.7527 88.7471 78.6243 10.9165
temp: 298.150 k
press: 1.00000 atm
elementType: 16 16 8 8 8 8 7 7 7 7 6 6 6 6 6 6 6 6 6 6 6 6 1 1 1 1 1 1 1 1 1 1 1 1 1 1
symmnumber: 1
zpe: 691700.5 jmol-1
zpe.correction: 0.263455 hartree
zpe.thermalcorrener: 0.285907 hartree
zpe.thermalcorrenthalpy: 0.286851 hartree
zpe.thermalcorrgfe: 0.208385 hartree
zpe.sumelectzpe: -1780.166683 hartree
zpe.sumelectthermal: -1780.144231 hartree
zpe.sumelectthermalent: -1780.143287 hartree
zpe.sumelectthermalfe: -1780.221753 hartree
dipole: 0.0103 -10.4505 0.0104
dipole: 10.4505
quadrupole: -131.6347 -132.3155 -131.8957
quadrupole: -0.0500 -17.4512 -0.0265
quadrupole: 0.3139 -0.3669 0.0530 -0.0500 -17.4512 -0.0265
hfenergy: -1780.4301379 hartree
pointgroup: C01 [X(C12H14N4O4S2)]
dipole: -0.0015436 4.1115535 0.0058553 debye
polarizability: 296.031776|-0.0714865|228.9357032|-17.491369|0.0532721|137.5283625 unknown
InChI: InChI=1S/C12H14N4O4S2/c13-11(19)21-5-9(17)15-7-2-1-3-8(4-7)16-10(18)6-22-12(14)20/h1-4,15-16H,5-6,13-14H2
charge 0 multiplicity 1
36 atoms
S  5.237884 1.055271 0.226445
S  -5.237762 1.057531 -0.224446
O  3.953018 -2.150545 -1.158301
O  -3.952019 -2.149048 1.15667
O  2.784433 2.274751 -0.179312
O  -2.783581 2.277084 0.176855
N  2.314069 -0.508589 -0.702227
N  -2.312241 -0.507721 0.701436
N  4.143802 3.200011 1.468544
N  -4.148605 3.206152 -1.464148
C  1.178721 -1.293871 -0.357157
C  -1.177495 -1.293427 0.355359
C  0.000877 -0.591084 -0.000463
C  1.183123 -2.715071 -0.360747
C  -1.182965 -2.714628 0.357176
C  -0.000177 -3.393948 -0.00221
C  3.583223 -0.941955 -1.050912
C  -3.581625 -0.940586 1.049898
C  4.559771 0.208453 -1.336201
C  -4.55733 0.210128 1.33691
C  3.86235 2.288258 0.483064
C  -3.863603 2.291853 -0.482058
H  0.001294 0.507079 0.00024
H  2.091996 -3.25124 -0.636658
H  -2.09224 -3.250455 0.632422
H  -0.000589 -4.489769 -0.002895
H  2.209022 0.518629 -0.630537
H  -2.20638 0.51952 0.631187
H  5.450618 -0.200693 -1.833246
H  4.104405 1.005921 -1.94708
H  -5.447557 -0.198919 1.835143
H  -4.100849 1.007276 1.947374
H  5.036905 3.208458 1.958958
H  3.427879 3.882939 1.716211
H  -3.433821 3.890142 -1.712174
H  -5.043255 3.215493 -1.951719
