program: Gaussian 09
title: 000241666
version: EM64L-G09RevD.01
frameworkgroup: C1[X(C13H16N4O5S2)]
method: RPBEPBE
basis: SDD
operation: Freq
keyword: #p
keyword: freq=noraman
keyword: PBEPBE/SDD
title: #p freq=noraman PBEPBE/SDD
converged: YES YES NO NO
title: Mulliken charges:
elementType: S S O O O O O N N N N C C C C C C C C C C C C C H H H H H H H H H H H H H H H H
charge: 0.164701 0.170276 -0.293587 -0.262396 -0.264415 -0.240611 -0.252591 -0.450262 -0.453967 -0.578269 -0.574077 0.380519 0.558573 -0.610616 0.108449 -0.406657 -0.302707 0.260079 0.251254 -0.821101 -0.818461 -0.529573 0.019784 0.025179 0.320012 0.306803 0.238616 0.407218 0.374508 0.303507 0.297391 0.297790 0.302576 0.246751 0.223634 0.221531 0.341642 0.344715 0.342281 0.351496
chargesum: 0.00000
title: Mulliken charges with hydrogens summed into heavy atoms:
elementType: S S O O O O O N N N N C C C C C C C C C C C C C
charge: 0.164701 0.170276 -0.293587 -0.262396 -0.264415 -0.240611 -0.252591 -0.043044 -0.079459 0.108089 0.119700 0.380519 0.558573 -0.290605 0.108449 -0.099853 -0.064091 0.260079 0.251254 -0.220202 -0.218095 0.162344 0.019784 0.025179
polarizability: 3.23471113e+02 -2.90461001e+00 2.60591057e+02 -4.76551362e+00 7.60908190e+00 1.39228447e+02
1716.lowfreq: -2.6793 0.0005 0.0006 0.0019 2.1532 4.6243 14.7144 19.8358 31.9823
frequency: 14.7100 19.8112 31.9792 39.3687 49.6024 58.0674 64.3656 71.0703 78.6312 94.2734 98.0429 109.6120 132.5217 142.5595 163.9242 188.0279 202.9406 207.0718 224.1081 245.3887 283.1541 298.6098 300.9309 338.9427 357.3866 378.1430 388.9386 405.1411 442.0904 443.3635 460.2631 464.4058 465.2904 476.6467 489.1617 535.3801 545.8435 549.1112 564.8029 583.7674 609.7807 612.6368 636.7610 640.2565 641.8300 647.6238 676.6228 732.5048 743.4705 748.1806 758.8259 800.9833 820.4304 860.7284 871.1532 874.1892 897.0267 916.1740 940.1847 941.4195 957.3335 991.1717 1004.1647 1060.1881 1061.8143 1117.8322 1118.1897 1144.0906 1149.9886 1155.7426 1197.5365 1214.2820 1241.0314 1244.0640 1248.7709 1265.2565 1266.5914 1271.9809 1279.0821 1317.3882 1386.5294 1411.2166 1414.1095 1430.2113 1438.6504 1466.9723 1471.1326 1489.8818 1528.0220 1556.9549 1592.3296 1598.2991 1603.8885 1612.9023 1619.0151 1623.1964 1655.4080 1656.9929 2961.0447 3042.5194 3044.1991 3048.7270 3127.9084 3143.5593 3144.0258 3157.6796 3166.7974 3197.3730 3313.9446 3364.5829 3521.0881 3523.3074 3673.7947 3675.6488
redmass: 7.2331 6.6531 5.7390 6.9160 8.1267 6.9667 7.6673 5.5834 6.5860 5.9527 7.1076 4.9820 4.7759 6.9813 7.4154 5.7076 5.7911 3.1422 5.1782 1.3702 4.9060 5.6690 3.9908 3.5702 4.3491 4.3438 3.8562 4.8342 9.5838 7.6598 3.3044 2.5601 1.3590 1.4742 3.8765 1.2425 1.2812 5.9261 5.7016 5.9751 3.9137 3.7633 4.2467 4.3306 5.6239 4.0846 5.9684 5.8029 6.3889 3.7072 5.9888 4.7795 1.4369 1.5253 1.2347 1.4093 2.0390 4.1788 1.6123 4.2976 1.3222 4.6048 4.6394 2.0459 2.0324 1.4212 1.7797 1.3133 1.2362 1.3271 1.6152 2.0979 1.7860 1.2558 1.4961 1.9545 2.1144 2.8896 2.9825 2.5047 6.3831 1.1163 1.1183 2.2555 1.6846 1.0564 1.2138 1.8692 2.3943 2.1581 1.6534 1.5291 8.0042 3.3622 2.6431 4.8688 3.5893 4.2620 1.0328 1.0609 1.0603 1.1040 1.0996 1.1047 1.1041 1.0897 1.0931 1.0950 1.0820 1.0799 1.0448 1.0448 1.1051 1.1051
irintensity: 3.0533 1.0765 4.2814 2.2012 2.6322 2.8828 6.4608 5.5994 4.4379 3.8826 12.6846 10.2949 7.5642 3.0250 6.5190 4.1395 13.2695 1.1668 2.7424 0.6260 7.2458 3.5948 4.9241 5.7002 3.2851 2.1104 5.1398 0.8341 1.7695 0.5867 18.1816 7.0975 11.4215 2.9402 31.0693 281.0000 267.8784 5.5201 17.3692 13.2898 51.9637 49.7985 9.5045 59.5419 6.7042 68.2002 8.5555 7.0712 3.0210 4.1493 10.8213 1.2225 36.6708 75.9125 7.0225 106.7032 1.4847 2.8168 84.6508 16.9361 1.9837 27.6408 31.1454 8.0567 6.6256 25.3207 59.7790 9.0748 38.4585 9.7103 13.1022 50.2501 20.2333 30.0084 33.3269 10.1771 209.8189 154.2901 202.1214 0.7441 64.2279 32.4316 33.4524 77.9310 58.6214 17.8266 134.3472 115.8272 757.6485 152.3938 17.2494 14.3882 331.8630 159.4787 247.3922 35.0421 153.7337 362.2934 79.8935 6.2136 6.1062 45.6347 18.8779 0.1286 0.1170 13.2403 10.2757 7.6993 286.2908 174.7787 81.5281 76.3545 44.2458 40.6272
temp: 298.150 k
press: 1.00000 atm
elementType: 16 16 8 8 8 8 8 7 7 7 7 6 6 6 6 6 6 6 6 6 6 6 6 6 1 1 1 1 1 1 1 1 1 1 1 1 1 1 1 1
symmnumber: 1
zpe: 773664.7 jmol-1
zpe.correction: 0.294673 hartree
zpe.thermalcorrener: 0.319996 hartree
zpe.thermalcorrenthalpy: 0.320941 hartree
zpe.thermalcorrgfe: 0.235793 hartree
zpe.sumelectzpe: -1894.518158 hartree
zpe.sumelectthermal: -1894.492835 hartree
zpe.sumelectthermalent: -1894.491891 hartree
zpe.sumelectthermalfe: -1894.577038 hartree
dipole: -4.0215 -1.6299 -0.4159
dipole: 4.3591
quadrupole: -103.3460 -142.7754 -147.8305
quadrupole: -32.2198 -19.7954 6.6872
quadrupole: 27.9713 -11.4581 -16.5132 -32.2198 -19.7954 6.6872
hfenergy: -1894.8128313 hartree
pointgroup: C01 [X(C13H16N4O5S2)]
dipole: 1.5437116 -0.7134127 0.2218782 debye
polarizability: 323.1258171|-2.6953232|256.0052914|-10.3324155|-23.9258896|144.1595079 unknown
InChI: InChI=1S/C13H16N4O5S2/c1-22-9-3-2-7(16-10(18)5-23-12(14)20)4-8(9)17-11(19)6-24-13(15)21/h2-4,16-17H,5-6,14-15H2,1H3
charge 0 multiplicity 1
40 atoms
S  4.37212 -2.827351 -0.489521
S  -5.77128 -0.29343 0.458969
O  2.666332 2.123918 0.321704
O  0.883051 -2.48748 0.556057
O  -3.86514 2.535984 -1.066963
O  5.02553 -0.24241 0.255107
O  -3.75276 -2.061625 -0.21486
N  2.028494 -0.428909 0.463219
N  -2.652558 0.539751 -0.715986
N  6.271165 -1.167118 -1.485871
N  -5.122793 -2.68863 1.559049
C  0.974691 0.457331 0.121508
C  -1.338951 1.028885 -0.466698
C  -0.353844 0.058921 -0.134679
C  1.315073 1.845292 0.043935
C  -0.9973 2.401583 -0.542096
C  0.33432 2.798068 -0.285079
C  1.946379 -1.798713 0.652351
C  -3.799742 1.270131 -0.969953
C  3.279142 -2.458752 1.018296
C  -5.052131 0.403754 -1.159971
C  3.107048 3.514816 0.246703
C  5.291349 -1.197668 -0.523308
C  -4.72639 -1.837865 0.558991
H  -0.604386 -1.00297 -0.065092
H  -1.76516 3.134476 -0.793332
H  0.590208 3.860117 -0.343849
H  2.96122 0.007174 0.554801
H  -2.786093 -0.484768 -0.650384
H  3.89015 -1.8365 1.69315
H  3.076101 -3.442109 1.465064
H  -5.855659 1.031543 -1.569989
H  -4.865378 -0.466574 -1.811341
H  4.17958 3.489963 0.488246
H  2.569722 4.143418 0.983172
H  2.958846 3.926661 -0.770512
H  6.466138 -1.967945 -2.084668
H  6.808102 -0.308464 -1.604089
H  -5.935722 -2.497658 2.14257
H  -4.570775 -3.530751 1.72265
