program: Gaussian 09
title: 000241317
version: EM64L-G09RevD.01
frameworkgroup: C1[X(C23H18N4O)]
method: RPBEPBE
basis: SDD
operation: Freq
keyword: #p
keyword: freq=noraman
keyword: PBEPBE/SDD
title: #p freq=noraman PBEPBE/SDD
converged: YES YES NO NO
title: Mulliken charges:
elementType: O N N N N C C C C C C C C C C C C C C C C C C C C C C C H H H H H H H H H H H H H H H H H H
charge: -0.198331 0.058003 0.057830 -0.425425 -0.425649 0.220271 0.220367 0.408805 0.408853 0.288995 0.288823 -0.369576 -0.369710 -0.439379 -0.439516 -0.422287 -0.422352 -0.386647 -0.386600 -0.239023 -0.239164 -0.256024 -0.255969 -0.247364 -0.247413 -0.379551 -0.379644 0.344208 0.209035 0.209087 0.240155 0.240179 0.238756 0.238744 0.286603 0.286722 0.232582 0.232570 0.226875 0.226861 0.230493 0.230484 0.193043 0.193205 0.258993 0.259083
chargesum: 0.00000
title: Mulliken charges with hydrogens summed into heavy atoms:
elementType: O N N N N C C C C C C C C C C C C C C C C C C C C C C C
charge: -0.198331 0.058003 0.057830 -0.166432 -0.166566 0.220271 0.220367 0.408805 0.408853 0.288995 0.288823 -0.160541 -0.160623 -0.199225 -0.199337 -0.183532 -0.183608 -0.100044 -0.099878 -0.006441 -0.006594 -0.029148 -0.029108 -0.016870 -0.016928 -0.186508 -0.186439 0.344208
polarizability: 6.97515515e+02 3.19850334e-01 3.36513087e+02 1.61304175e+00 -8.54362864e-01 1.09004334e+02
1716.lowfreq: -0.0012 0.0003 0.0013 1.2608 4.5280 5.6492 11.6012 19.4194 23.2925
frequency: 11.3726 18.9269 23.2890 41.0626 46.2424 63.3610 88.0148 93.5071 129.0315 137.7440 155.1408 165.8299 178.0871 182.9137 201.3061 206.0738 216.6967 304.3854 305.5305 315.2164 360.6917 360.9057 425.0951 425.6588 443.6014 449.1136 474.6372 474.7262 487.9953 502.3718 507.4140 512.5023 526.1767 553.3551 553.7546 557.8799 596.6114 633.0194 650.5702 650.6385 651.7953 685.0537 732.6300 743.3214 743.7398 767.2933 786.2896 787.6518 788.4197 788.5861 791.9474 815.0884 815.4885 866.9667 881.2246 881.4820 886.0266 915.5808 916.9595 942.3847 942.6854 961.8226 962.1602 990.0263 990.0590 999.0797 1002.0906 1002.1172 1005.1146 1019.5396 1033.0927 1037.2776 1053.0336 1091.4777 1091.8074 1136.8763 1147.9710 1153.7480 1162.1453 1177.1202 1177.1540 1191.2347 1193.8975 1236.9545 1237.1283 1255.7977 1257.4327 1274.5693 1274.9991 1343.0173 1344.0616 1379.6271 1381.2887 1404.9018 1405.0392 1413.9456 1414.5365 1441.9088 1442.2158 1454.8986 1455.2390 1500.0677 1506.1470 1521.1395 1525.6484 1560.4056 1566.9203 1587.8221 1588.0111 1592.9105 1593.1818 1630.4947 1630.6770 1692.6705 2994.4275 2995.1116 3122.4678 3122.9593 3126.4606 3126.9709 3131.1961 3131.5323 3147.9869 3148.2660 3148.6980 3148.9712 3164.2087 3164.3691 3166.9901 3167.1404 3339.5668 3349.4230
redmass: 4.8203 6.1102 6.1632 6.2154 4.3643 5.8585 4.1704 2.5149 6.9694 5.8180 6.2992 4.0785 3.9485 3.8483 6.6746 4.0616 4.1326 4.3474 3.4663 6.8753 5.5025 6.3351 2.8965 2.9545 5.0908 5.5482 3.2632 3.2621 7.4579 6.6459 2.1366 2.5477 6.9499 3.6223 4.4017 3.0436 1.3375 6.1468 3.2358 3.2187 6.3037 7.8725 6.5003 1.3297 1.3280 5.6920 5.3274 4.9661 1.9302 1.9018 5.7388 1.4256 1.4287 4.4327 1.8936 1.8870 4.2050 1.5838 1.5743 1.3853 1.3861 1.4156 1.4147 1.3467 1.3465 6.2870 1.4132 1.3907 4.7386 4.1915 2.6481 2.2487 3.9460 2.0695 2.0519 2.7060 1.8238 1.4137 2.1657 1.0957 1.0954 1.2511 1.3823 1.8877 1.8814 1.6674 1.6554 1.9209 1.9276 1.5967 1.6519 2.2497 2.3002 2.5879 2.5715 5.8919 5.8336 2.4832 2.4952 2.3000 2.3402 1.9334 1.9468 3.7315 2.8505 5.5516 5.1830 6.8811 6.7997 5.7107 5.6386 6.4036 6.3947 8.7295 1.0856 1.0856 1.0859 1.0857 1.0873 1.0872 1.0878 1.0879 1.0937 1.0936 1.0929 1.0931 1.1004 1.1004 1.0978 1.0978 1.0749 1.0741
irintensity: 0.0049 0.0016 0.0647 18.5931 0.0529 7.2741 4.2352 0.6114 0.0139 0.4023 0.2642 0.4357 0.2137 6.4764 17.7398 0.1150 34.4650 1.4202 0.0172 9.5645 0.3662 14.2179 1.9983 15.5904 1.1171 0.6086 2.5689 0.5834 0.0074 1.5454 2.7135 0.5496 1.5972 21.5498 13.9451 0.0111 146.1937 42.5919 0.0720 0.4659 1.2969 18.8699 10.6342 7.5582 11.3853 0.9852 7.3094 0.4207 2.9129 165.5411 2.2601 24.2875 58.8034 1.6320 5.0575 9.5085 9.4731 2.0517 56.6952 1.6415 9.5008 1.6701 1.9198 0.0108 0.0344 1.4935 8.7969 0.2672 47.0203 7.9124 4.1500 5.3449 0.4391 66.5191 5.3812 2048.6598 8.0021 155.7412 15.5912 7.4246 0.6691 50.8053 2.9882 1.5385 4.9412 27.1260 10.5785 8.1647 6.2202 22.7729 4.3201 0.0968 34.6106 7.0669 4.9958 0.6306 2.7763 5.9098 6.0517 0.2108 21.9801 779.9794 0.8343 155.2170 20.5750 1.8967 3.3675 21.1928 1.0386 2.2409 3.1892 0.4103 0.4072 202.5481 47.5018 52.4384 2.8319 2.5491 1.8841 1.6629 2.3652 2.5846 16.9168 12.7144 55.8909 50.6292 34.1428 43.7725 10.8328 10.9351 55.6807 3.9323
temp: 298.150 k
press: 1.00000 atm
elementType: 8 7 7 7 7 6 6 6 6 6 6 6 6 6 6 6 6 6 6 6 6 6 6 6 6 6 6 6 1 1 1 1 1 1 1 1 1 1 1 1 1 1 1 1 1 1
symmnumber: 1
zpe: 929201.2 jmol-1
zpe.correction: 0.353914 hartree
zpe.thermalcorrener: 0.377115 hartree
zpe.thermalcorrenthalpy: 0.378059 hartree
zpe.thermalcorrgfe: 0.297748 hartree
zpe.sumelectzpe: -1179.528092 hartree
zpe.sumelectthermal: -1179.504892 hartree
zpe.sumelectthermalent: -1179.503947 hartree
zpe.sumelectthermalfe: -1179.584259 hartree
dipole: -0.0081 6.1992 0.0207
dipole: 6.1993
quadrupole: -121.3896 -148.6047 -172.7165
quadrupole: 0.0582 -0.1940 -0.4394
quadrupole: 26.1806 -1.0344 -25.1462 0.0582 -0.1940 -0.4394
hfenergy: -1179.8820063 hartree
pointgroup: C01 [X(C23H18N4O1)]
dipole: -0.0039388 -2.4212616 -0.2934538 debye
polarizability: 697.5097157|-0.1440605|333.5967312|-2.4589987|25.6077021|111.9264895 unknown
InChI: InChI=1S/C23H18N4O/c28-23(26-24-15-19-11-5-9-17-7-1-3-13-21(17)19)27-25-16-20-12-6-10-18-8-2-4-14-22(18)20/h1-16,26-27H
charge 0 multiplicity 1
46 atoms
O  -0.000193 2.061178 0.251623
N  -2.403985 0.58502 0.128413
N  2.402526 0.595914 0.021323
N  -1.160538 0.016179 -0.032088
N  1.16011 0.004888 0.066615
C  -5.983968 -0.490433 -0.113653
C  5.983851 -0.498978 -0.0560
C  -7.301762 0.10452 0.032069
C  7.299214 0.117136 -0.10514
C  -4.816213 0.35268 0.077151
C  4.814267 0.362386 -0.026278
C  -5.914749 -1.888053 -0.439488
C  5.919168 -1.934128 -0.040979
C  -7.423294 1.492737 0.361804
C  7.416596 1.544163 -0.123462
C  -8.470179 -0.707471 -0.155416
C  8.469403 -0.713155 -0.135775
C  -4.989474 1.714598 0.40212
C  4.983435 1.762836 -0.046128
C  -6.283571 2.281923 0.544727
C  6.2751 2.351235 -0.094403
C  -7.07038 -2.653647 -0.615265
C  7.076492 -2.716519 -0.071638
C  -8.36363 -2.061015 -0.473761
C  8.367258 -2.103766 -0.119455
C  -3.456748 -0.185452 -0.069752
C  3.456602 -0.197886 0.02471
C  -0.000298 0.823965 0.110572
H  -4.944255 -2.380866 -0.555006
H  4.950673 -2.442856 -0.005299
H  -8.424906 1.925814 0.468411
H  8.416474 1.992448 -0.16039
H  -9.455456 -0.239548 -0.042022
H  9.452713 -0.229213 -0.172869
H  -4.095059 2.330235 0.539482
H  4.087492 2.390952 -0.021748
H  -6.38101 3.343125 0.796857
H  6.369267 3.442183 -0.107592
H  -6.98725 -3.71759 -0.863657
H  6.996555 -3.80924 -0.059234
H  -9.261887 -2.671541 -0.614943
H  9.266957 -2.727903 -0.143242
H  -3.339661 -1.247869 -0.355883
H  3.341858 -1.297669 0.066173
H  -1.070056 -0.974362 -0.310868
H  1.07031 -1.023057 0.114682
