program: Gaussian 09
title: 000241314
version: EM64L-G09RevD.01
frameworkgroup: C1[X(C12H11Cl3O4)]
method: RPBEPBE
basis: SDD
operation: Freq
keyword: #p
keyword: freq=noraman
keyword: PBEPBE/SDD
title: #p freq=noraman PBEPBE/SDD
converged: YES YES NO NO
title: Mulliken charges:
elementType: Cl Cl Cl O O O O C C C C C C C C C C C C H H H H H H H H H H H
charge: -0.017189 -0.074725 -0.053630 -0.237833 -0.257362 -0.198755 -0.260052 0.372020 0.133984 -0.300902 -0.341201 0.131983 0.204800 -0.222960 -0.208330 -0.250055 -0.255442 -0.563010 -0.573044 0.284807 0.266063 0.246401 0.256670 0.246393 0.253422 0.257447 0.322343 0.265621 0.300896 0.271640
chargesum: 0.00000
title: Mulliken charges with hydrogens summed into heavy atoms:
elementType: Cl Cl Cl O O O O C C C C C C C C C C C C
charge: -0.017189 -0.074725 -0.053630 -0.237833 -0.257362 -0.198755 -0.260052 0.372020 0.133984 -0.300902 -0.056394 0.131983 0.204800 0.043103 0.038071 0.253008 0.255427 0.024954 -0.000508
polarizability: 2.07971049e+02 3.70278798e+00 1.88838876e+02 -1.62958943e+01 1.97144962e+01 1.08996103e+02
1716.lowfreq: -7.1107 -6.0147 -0.0009 -0.0005 0.0002 5.4650 20.0234 29.8211 31.1999
frequency: 19.9950 29.7407 31.1285 34.8757 50.4911 62.9427 88.2774 104.2437 129.4251 148.0278 154.4647 171.9403 184.5391 218.2955 231.6882 247.7611 285.2444 325.2824 346.3996 366.4746 390.7048 399.1509 454.1372 469.3299 490.8287 525.4077 564.3664 595.2523 606.2180 669.9691 676.8023 700.2743 712.6850 740.7657 770.1757 775.7951 810.6525 830.4041 849.8960 928.7376 933.0411 937.8051 981.3508 993.1701 995.0567 1026.2784 1053.8996 1062.2945 1080.5142 1088.4830 1149.7958 1176.8780 1183.0005 1199.1415 1222.9862 1240.6674 1243.4603 1257.9897 1303.6422 1305.4029 1360.7055 1369.9087 1372.2513 1425.6520 1432.4909 1435.5689 1437.3681 1444.5232 1445.9289 1565.5971 1594.3917 1617.5366 1647.5507 3012.2063 3012.6298 3063.7272 3064.3709 3114.9551 3118.5231 3152.8124 3154.3120 3157.5241 3174.9146 3187.3492
redmass: 10.5732 8.8110 10.4638 10.8213 7.4419 13.6023 7.2628 4.2703 8.9682 5.6237 6.8186 4.6392 4.2345 8.5042 9.7203 6.6182 7.4414 3.6442 2.8918 3.9232 4.8531 6.6604 4.4298 3.3963 4.0087 5.1902 4.6999 4.9765 4.8329 6.7368 6.8861 7.1381 7.6974 3.4364 3.6234 3.6188 1.9658 3.2022 3.1612 1.4764 2.0111 2.1933 2.4749 1.3762 1.9727 3.4502 2.4068 2.6790 3.0932 3.6376 1.8157 1.3106 1.2413 1.5084 3.1500 1.1615 1.1914 2.5086 1.1739 1.1585 1.3098 2.2255 2.3897 2.3204 1.1262 1.1831 1.1188 1.1066 2.4443 7.2857 7.5919 9.9950 11.3051 1.0641 1.0627 1.0589 1.0585 1.1015 1.1015 1.1085 1.0880 1.1094 1.0937 1.0984
irintensity: 0.1498 1.9690 0.9395 2.0229 0.9180 1.4989 2.9336 7.2751 1.8365 4.9702 0.1374 9.1900 1.5622 2.6274 3.9220 1.2753 1.3113 3.0079 27.1706 13.0804 0.6652 12.2988 0.9026 7.3462 17.2990 3.6730 3.3955 21.7571 28.1892 9.1852 7.4858 31.7792 6.2964 53.7354 4.7992 25.5991 24.2036 16.2353 25.3731 5.2549 38.4775 24.8415 25.7999 0.4089 15.8854 123.7989 21.0261 12.0572 20.6321 187.8947 116.0370 41.7309 23.7475 78.0194 136.6060 3.9087 15.2466 259.8567 22.2119 30.3688 6.8733 1.0969 6.5570 42.2108 40.0360 9.0907 18.0076 20.5595 33.3801 19.6065 33.9937 137.0093 168.0984 15.7137 19.2763 10.7152 26.7502 4.3157 3.2340 8.6760 4.6958 1.1494 1.5973 4.3949
temp: 298.150 k
press: 1.00000 atm
elementType: 17 17 17 8 8 8 8 6 6 6 6 6 6 6 6 6 6 6 6 1 1 1 1 1 1 1 1 1 1 1
symmnumber: 1
zpe: 550225.1 jmol-1
zpe.correction: 0.209570 hartree
zpe.thermalcorrener: 0.228927 hartree
zpe.thermalcorrenthalpy: 0.229872 hartree
zpe.thermalcorrgfe: 0.157632 hartree
zpe.sumelectzpe: -2143.550415 hartree
zpe.sumelectthermal: -2143.531057 hartree
zpe.sumelectthermalent: -2143.530113 hartree
zpe.sumelectthermalfe: -2143.602352 hartree
dipole: 0.5396 0.1509 -1.3353
dipole: 1.4480
quadrupole: -131.1444 -114.0029 -137.3248
quadrupole: 6.7633 4.5315 8.4257
quadrupole: -3.6537 13.4878 -9.8341 6.7633 4.5315 8.4257
hfenergy: -2143.7599845 hartree
pointgroup: C01 [X(C12H11Cl3O4)]
dipole: -0.2460595 -0.0520641 -0.5111798 debye
polarizability: 209.7227266|1.9426235|188.8532807|9.5245075|-19.8952768|107.2300205 unknown
InChI: InChI=1S/C12H11Cl3O4/c13-4-6-18-11(16)8-2-1-3-9(15)10(8)12(17)19-7-5-14/h1-3H,4-7H2
charge 0 multiplicity 1
30 atoms
Cl 4.190919 0.963828 0.022316
Cl -1.291342 -3.630886 -0.897272
Cl -4.771713 2.057315 0.907004
O  1.302515 -1.642016 -0.447331
O  -2.226528 0.66488 -0.544807
O  2.09503 -1.047487 1.676317
O  -1.073449 -0.64471 0.999955
C  1.400905 0.673822 0.061537
C  0.081017 1.160987 -0.17344
C  2.481234 1.541067 -0.20453
C  -0.126882 2.473287 -0.662295
C  1.634092 -0.730681 0.562304
C  -1.08765 0.295808 0.167478
C  2.288594 2.852758 -0.682715
C  0.975006 3.316561 -0.910983
C  1.359157 -3.079497 -0.076076
C  -3.450489 -0.135952 -0.279034
C  0.0209 -3.561805 0.465727
C  -4.14849 0.279348 1.008354
H  -1.150173 2.817052 -0.831709
H  3.153897 3.492158 -0.8785
H  0.818005 4.33437 -1.280824
H  1.644853 -3.600016 -1.002394
H  2.133989 -3.219198 0.702275
H  -3.16885 -1.204662 -0.214149
H  -4.080741 0.042148 -1.162976
H  -0.386343 -2.884051 1.227857
H  0.10076 -4.594224 0.839191
H  -3.482144 0.236404 1.880412
H  -5.043375 -0.340507 1.173709
