program: Gaussian 09
title: 000241310
version: EM64L-G09RevD.01
frameworkgroup: C1[X(C14H17ClO4)]
method: RPBEPBE
basis: SDD
operation: Freq
keyword: #p
keyword: freq=noraman
keyword: PBEPBE/SDD
title: #p freq=noraman PBEPBE/SDD
converged: YES YES NO NO
title: Mulliken charges:
elementType: Cl O O O O C C C C C C C C C C C C C C H H H H H H H H H H H H H H H H H
charge: -0.042377 -0.285581 -0.278058 -0.236828 -0.247515 0.044688 0.039828 0.181798 0.184978 0.173999 0.170374 -0.681376 -0.684789 -0.691694 -0.677202 -0.307058 -0.364683 -0.096754 -0.216019 0.234110 0.232632 0.213987 0.248406 0.224224 0.211723 0.230918 0.226454 0.210098 0.233160 0.220067 0.205524 0.256161 0.235542 0.289595 0.276436 0.265231
chargesum: 0.00000
title: Mulliken charges with hydrogens summed into heavy atoms:
elementType: Cl O O O O C C C C C C C C C C C C C C
charge: -0.042377 -0.285581 -0.278058 -0.236828 -0.247515 0.278798 0.272460 0.181798 0.184978 0.173999 0.170374 0.005241 -0.015694 -0.028368 0.020026 -0.017463 -0.088247 -0.096754 0.049212
polarizability: 2.38150666e+02 -5.51509288e-01 1.93707880e+02 8.38826828e+00 5.30895293e+00 1.09303333e+02
1716.lowfreq: -7.4497 -5.5210 -0.0023 -0.0023 -0.0016 2.4822 16.3312 28.1235 46.2481
frequency: 16.0490 27.7488 46.2463 50.9149 68.0150 73.1623 88.8472 99.2431 138.6854 153.9922 171.8904 178.7694 185.4027 194.7134 207.5983 236.5479 239.3990 262.1554 279.7364 311.2826 339.5286 351.2162 386.7510 394.2686 403.8481 419.3117 436.4370 461.7457 483.4486 538.7231 575.8753 653.4573 665.7773 705.0788 726.1256 758.0094 777.6019 788.5328 799.9002 846.7627 850.7358 898.9242 904.1092 911.2315 927.6238 928.5093 941.7455 944.5189 976.0420 1028.2300 1075.5088 1089.4745 1099.3488 1104.4558 1133.1650 1155.7213 1158.6740 1181.0040 1182.5674 1223.9079 1243.0383 1265.0015 1322.1169 1326.0496 1333.3786 1336.2099 1373.5728 1381.0268 1382.4206 1383.7928 1397.3322 1398.3947 1453.0563 1456.3077 1463.6329 1464.4046 1468.8137 1468.9289 1471.7148 1484.6532 1487.0128 1567.3846 1590.1530 1610.7590 1619.0611 2990.1620 2990.5827 2993.8376 2996.0809 3022.0825 3026.5806 3086.2753 3087.0684 3094.1311 3094.9599 3097.9709 3098.2831 3104.1617 3112.5763 3159.4219 3180.1718 3187.1174
redmass: 3.9153 3.2808 3.1487 3.7025 5.1547 4.7258 5.1426 6.1821 5.0006 6.2255 1.0931 3.1591 1.0808 2.2985 1.7060 2.1653 1.4915 4.2714 7.0226 5.6307 3.2984 5.1148 3.3909 4.0847 4.2216 3.1332 2.9554 2.8674 4.2099 4.4152 5.9268 7.2243 5.6045 8.2833 8.1470 4.4606 3.9001 3.9738 5.9374 1.9054 3.4710 2.5804 2.7297 1.5015 1.2158 1.2473 1.3756 1.3501 1.3763 6.9084 7.9665 2.1200 1.7867 1.6878 1.5705 2.0631 2.0583 1.9610 1.9523 3.0288 2.2467 1.5139 1.4249 1.4524 1.4134 1.3775 6.2509 1.2705 4.5485 1.2549 1.2319 1.2264 1.0552 1.0512 1.0539 1.0539 1.1228 2.2742 1.0556 1.0500 1.0519 8.8108 7.3299 11.2527 11.4286 1.0355 1.0357 1.0359 1.0364 1.0863 1.0865 1.0995 1.0994 1.0988 1.0983 1.1004 1.1007 1.1005 1.1006 1.0892 1.0969 1.0929
irintensity: 0.1160 0.2748 0.2877 0.4698 1.3903 1.1563 0.9380 3.4553 0.2537 1.3517 0.2621 1.8395 0.0936 2.9446 2.1529 5.0353 3.6123 1.3233 0.2277 1.5014 1.0848 6.2041 4.0560 10.2231 3.7932 2.0180 1.5618 0.8035 14.7438 11.7308 10.1533 0.6471 6.7036 24.2989 23.2696 5.0864 11.5984 12.1331 4.0239 24.5596 29.1408 13.3699 17.7278 16.5765 2.6911 1.8224 0.3123 0.3749 1.5840 187.6344 379.7924 145.9927 45.0936 31.1525 21.1109 9.8718 11.7302 10.2879 55.3650 125.1764 322.0680 87.6078 8.1062 9.9014 1.5410 2.3515 7.3573 32.9266 7.8134 34.8876 13.8243 26.1376 5.6668 6.6739 4.5728 5.2417 2.1144 43.2562 6.1930 21.2380 20.4393 29.3947 134.0016 155.0185 128.2146 10.5939 19.9603 21.4746 22.7840 8.9816 6.8657 7.9038 2.1316 49.5950 63.1719 30.2448 11.8548 33.9865 19.1863 0.1599 1.6530 1.3051
temp: 298.150 k
press: 1.00000 atm
elementType: 17 8 8 8 8 6 6 6 6 6 6 6 6 6 6 6 6 6 6 1 1 1 1 1 1 1 1 1 1 1 1 1 1 1 1 1
symmnumber: 1
zpe: 737665.1 jmol-1
zpe.correction: 0.280962 hartree
zpe.thermalcorrener: 0.301729 hartree
zpe.thermalcorrenthalpy: 0.302673 hartree
zpe.thermalcorrgfe: 0.229284 hartree
zpe.sumelectzpe: -1303.238077 hartree
zpe.sumelectthermal: -1303.217310 hartree
zpe.sumelectthermalent: -1303.216366 hartree
zpe.sumelectthermalfe: -1303.289755 hartree
dipole: -1.4678 2.4652 1.8248
dipole: 3.4002
quadrupole: -112.6074 -109.0124 -124.0411
quadrupole: -6.2252 -5.0318 -5.8029
quadrupole: 2.6129 6.2079 -8.8208 -6.2252 -5.0318 -5.8029
hfenergy: -1303.5190392 hartree
pointgroup: C01 [X(C14H17Cl1O4)]
dipole: -0.3922213 -0.9721263 -0.8310967 debye
polarizability: 236.3005855|9.714226|193.5158416|-8.9886222|13.2084292|111.3454527 unknown
InChI: InChI=1S/C14H17ClO4/c1-8(2)18-13(16)11-6-5-10(15)7-12(11)14(17)19-9(3)4/h5-9H,1-4H3
charge 0 multiplicity 1
36 atoms
Cl 4.97021 1.014775 -0.406185
O  0.621681 -2.06845 -0.388307
O  -1.803447 0.994513 -0.490548
O  -0.788033 -1.08798 1.195954
O  -1.541036 2.791643 0.978928
C  -0.091137 -3.390947 -0.215465
C  -3.307875 1.142615 -0.437023
C  0.970453 0.236612 0.124658
C  0.410938 1.543229 0.226536
C  0.152215 -0.999054 0.371642
C  -1.059389 1.835328 0.3219
C  -1.335822 -3.390613 -1.113659
C  0.943171 -4.458314 -0.577091
C  -3.811258 0.516559 -1.73871
C  -3.831647 0.461754 0.835401
C  2.364642 0.084553 -0.078727
C  1.268403 2.669692 0.182879
C  3.181793 1.225869 -0.144792
C  2.658825 2.525008 0.000642
H  -0.389636 -3.457786 0.847514
H  -3.518886 2.228309 -0.402882
H  -1.871289 -4.35233 -1.012705
H  -2.024445 -2.578885 -0.824607
H  -1.049972 -3.258221 -2.171895
H  0.498156 -5.463462 -0.464384
H  1.825627 -4.393456 0.082222
H  1.277174 -4.34066 -1.622857
H  -4.909953 0.616016 -1.801244
H  -3.36399 1.014914 -2.615623
H  -3.556316 -0.557467 -1.779099
H  -4.936227 0.508372 0.851179
H  -3.449365 0.966251 1.737543
H  -3.517419 -0.595258 0.868181
H  2.789018 -0.917901 -0.168568
H  0.827348 3.665621 0.287637
H  3.315292 3.398554 -0.035343
