program: Gaussian 09
title: 000241309
version: EM64L-G09RevD.01
frameworkgroup: C1[X(C14H17ClO4)]
method: RPBEPBE
basis: SDD
operation: Freq
keyword: #p
keyword: freq=noraman
keyword: PBEPBE/SDD
title: #p freq=noraman PBEPBE/SDD
converged: YES YES NO NO
title: Mulliken charges:
elementType: Cl O O O O C C C C C C C C C C C C C C H H H H H H H H H H H H H H H H H
charge: -0.029894 -0.252447 -0.299895 -0.213847 -0.248685 0.053731 0.041811 0.371443 0.071584 0.143245 0.197995 -0.689599 -0.682947 -0.685522 -0.682098 -0.283625 -0.342380 -0.229156 -0.211369 0.239076 0.237023 0.205238 0.240272 0.220869 0.208913 0.256398 0.220693 0.212078 0.235409 0.221183 0.215349 0.253482 0.220444 0.280692 0.263138 0.241398
chargesum: 0.00000
title: Mulliken charges with hydrogens summed into heavy atoms:
elementType: Cl O O O O C C C C C C C C C C C C C C
charge: -0.029894 -0.252447 -0.299895 -0.213847 -0.248685 0.292807 0.278834 0.371443 0.071584 0.143245 0.197995 -0.023220 0.003057 -0.016853 0.007177 -0.283625 -0.061688 0.033982 0.030029
polarizability: 2.23754533e+02 7.70192186e-01 1.96570752e+02 4.61576528e+00 -1.06039424e+01 1.15566982e+02
1716.lowfreq: -6.3532 -5.0578 -0.0010 0.0007 0.0013 6.6929 13.2258 34.0072 39.2210
frequency: 12.8140 33.9640 39.2092 40.8909 65.4578 73.6684 89.9712 101.1215 138.3493 158.0581 180.2242 187.8175 188.3970 195.3905 209.6253 227.7696 241.9998 248.1586 263.7963 318.9207 344.5278 375.0069 385.7781 394.6736 404.6793 412.0638 441.2344 456.2087 493.8183 521.3252 562.0880 666.4101 689.9998 692.5797 702.8271 740.1315 781.8153 784.7817 809.7550 813.2609 841.5457 901.5941 905.6273 926.6550 928.1059 929.7519 942.9441 943.8026 992.2475 1028.7356 1074.8270 1091.5593 1100.8964 1108.2252 1151.3556 1156.9369 1157.9031 1181.8223 1183.3178 1196.2856 1232.8765 1245.9318 1325.6698 1327.6469 1333.0797 1336.0462 1370.3984 1381.4974 1382.3559 1395.7244 1397.8256 1422.7678 1443.0815 1456.5166 1456.7813 1465.6080 1466.1936 1471.4765 1471.9990 1486.4438 1488.1518 1563.5679 1594.0651 1612.2485 1623.9637 2989.2051 2990.7110 2992.4048 2993.6391 3030.5420 3032.1813 3084.0032 3085.8984 3092.4892 3094.2065 3099.2848 3100.5651 3104.8796 3106.1403 3151.2484 3173.7733 3189.3048
redmass: 3.6166 2.9941 3.3950 5.0506 4.8126 5.2593 4.4303 5.5755 8.1393 6.6005 4.0575 4.3349 1.0380 1.0311 2.5232 1.7872 1.7016 1.8542 3.9782 4.0893 3.1661 3.5088 6.3784 4.5523 4.1452 4.0577 3.0248 2.7832 5.2407 5.0596 3.7039 6.7880 8.4780 7.8180 8.3516 2.9755 4.2706 2.5322 3.8675 3.1129 6.0953 2.6509 2.9086 1.2099 1.2107 1.3812 1.3778 1.3738 1.3489 6.9832 4.3519 2.4852 1.7675 1.8081 1.7109 2.0360 2.0416 1.9363 1.9525 1.4827 3.5709 2.3839 1.3545 1.5118 1.4431 1.3286 11.2002 1.2633 1.2617 1.2280 1.2294 2.4799 3.2069 1.0525 1.0530 1.0476 1.0469 1.0497 1.0510 1.0483 1.0485 7.4397 7.9713 10.5480 12.0251 1.0356 1.0356 1.0359 1.0360 1.0866 1.0868 1.0994 1.0995 1.0985 1.0986 1.1006 1.1007 1.1007 1.1006 1.0880 1.0945 1.0969
irintensity: 0.5044 0.0015 1.0921 0.0413 3.7909 1.1595 0.8796 0.1369 0.3669 0.5230 3.6840 0.2967 0.1687 0.0194 2.8235 1.2701 1.0805 2.2317 9.4530 6.4427 0.1996 6.9224 10.9988 6.4540 5.0796 1.0430 0.9794 2.1577 7.7375 9.5337 3.0588 0.9734 53.1149 3.2442 12.0547 32.2893 7.3672 26.0044 21.4183 6.7812 43.6332 13.5534 43.8244 2.4320 2.6526 0.2236 0.0678 0.6089 1.0854 199.2520 96.7650 214.8414 104.5399 15.1331 147.3975 9.7360 9.2746 58.7870 28.5384 58.6321 265.1315 265.7811 4.6708 9.2988 2.6244 2.4672 3.0084 26.7711 40.6095 21.2818 17.5924 27.5298 14.7741 5.3617 8.8202 6.1138 1.8394 7.2634 6.2138 10.7491 30.0902 33.6268 48.9255 126.4274 164.5523 13.4608 13.8666 28.0243 23.7381 4.9309 3.1541 2.7077 2.8612 52.9308 58.9269 18.7763 15.9927 29.8143 28.9927 5.8969 3.1443 5.3715
temp: 298.150 k
press: 1.00000 atm
elementType: 17 8 8 8 8 6 6 6 6 6 6 6 6 6 6 6 6 6 6 1 1 1 1 1 1 1 1 1 1 1 1 1 1 1 1 1
symmnumber: 1
zpe: 737468.5 jmol-1
zpe.correction: 0.280887 hartree
zpe.thermalcorrener: 0.301672 hartree
zpe.thermalcorrenthalpy: 0.302617 hartree
zpe.thermalcorrgfe: 0.228970 hartree
zpe.sumelectzpe: -1303.233834 hartree
zpe.sumelectthermal: -1303.213048 hartree
zpe.sumelectthermalent: -1303.212104 hartree
zpe.sumelectthermalfe: -1303.285751 hartree
dipole: -3.3589 0.5859 -2.5165
dipole: 4.2377
quadrupole: -103.5698 -101.2641 -126.1208
quadrupole: -2.5975 -3.3736 -1.0140
quadrupole: 6.7484 9.0542 -15.8026 -2.5975 -3.3736 -1.0140
hfenergy: -1303.5147208 hartree
pointgroup: C01 [X(C14H17Cl1O4)]
dipole: -1.2381531 0.0898836 -1.1129395 debye
polarizability: 220.9339698|4.7073687|197.7379324|16.3622733|-7.002629|117.2203644 unknown
InChI: InChI=1S/C14H17ClO4/c1-8(2)18-13(16)10-6-5-7-11(15)12(10)14(17)19-9(3)4/h5-9H,1-4H3
charge 0 multiplicity 1
36 atoms
Cl 3.303217 2.137931 0.372196
O  1.934536 -1.097108 -0.327238
O  -2.758501 -0.091218 -0.286895
O  1.636812 -0.552008 1.929982
O  -0.959582 -1.410755 0.393577
C  2.599731 -2.403271 0.050262
C  -3.675844 -1.288555 -0.18781
C  0.783837 0.924235 0.177193
C  -0.611416 0.954548 -0.118047
C  1.469182 -0.316748 0.713138
C  -1.417776 -0.299228 0.027507
C  2.346509 -3.33464 -1.135901
C  4.081448 -2.129196 0.339907
C  -5.067041 -0.707657 0.070623
C  -3.565035 -2.101388 -1.485307
C  1.514529 2.120437 0.01956
C  -1.224255 2.157066 -0.552376
C  0.920253 3.320708 -0.414071
C  -0.46314 3.333327 -0.698408
H  2.088486 -2.763888 0.961753
H  -3.321997 -1.891266 0.669119
H  2.779269 -4.330659 -0.93005
H  1.263503 -3.450773 -1.310374
H  2.81154 -2.934615 -2.054119
H  4.59431 -3.074902 0.595163
H  4.192117 -1.435363 1.189631
H  4.575678 -1.692006 -0.545582
H  -5.799341 -1.527785 0.180554
H  -5.077264 -0.10537 0.994889
H  -5.386857 -0.066968 -0.770077
H  -4.24675 -2.970479 -1.441604
H  -2.538311 -2.477917 -1.626956
H  -3.845737 -1.483276 -2.356437
H  -2.294614 2.148735 -0.769414
H  1.528832 4.222587 -0.525042
H  -0.937732 4.261065 -1.032847
