program: Gaussian 09
title: 000241696
version: EM64L-G09RevD.01
frameworkgroup: C1[X(C20H20Cl2N4O2)]
method: RPBEPBE
basis: SDD
operation: Freq
keyword: #p
keyword: freq=noraman
keyword: PBEPBE/SDD
title: #p freq=noraman PBEPBE/SDD
converged: YES YES NO NO
title: Mulliken charges:
elementType: Cl Cl O O N N N N C C C C C C C C C C C C C C C C C C C C H H H H H H H H H H H H H H H H H H H H
charge: -0.066076 -0.083184 -0.257486 -0.235590 -0.387113 -0.411206 0.047929 0.022318 -0.398580 -0.413030 -0.570413 -0.499007 0.308916 0.178480 0.518084 0.516307 -0.365612 -0.391544 -0.283775 -0.282263 -0.339925 -0.356528 -0.224375 -0.232502 -0.230331 -0.230621 -0.216506 -0.224543 0.218896 0.235303 0.211087 0.228527 0.243512 0.252113 0.246417 0.234856 0.296477 0.382952 0.233132 0.275857 0.291774 0.294171 0.259552 0.251845 0.245885 0.232716 0.240141 0.232964
chargesum: 0.00000
title: Mulliken charges with hydrogens summed into heavy atoms:
elementType: Cl Cl O O N N N N C C C C C C C C C C C C C C C C C C C C
charge: -0.066076 -0.083184 -0.257486 -0.235590 -0.090636 -0.028254 0.047929 0.022318 0.055619 0.026583 -0.074788 -0.017734 0.308916 0.178480 0.518084 0.516307 -0.132479 -0.115688 -0.283775 -0.282263 -0.048151 -0.062357 0.035177 0.019344 0.015553 0.002095 0.023634 0.008421
polarizability: 3.99340755e+02 4.42541552e+01 4.12348882e+02 -9.30341010e+00 1.08640513e+01 1.30152943e+02
1716.lowfreq: -3.8447 -1.2831 -0.0013 -0.0008 -0.0007 4.1577 11.2388 16.9794 19.4036
frequency: 11.0844 16.8973 19.3728 27.2499 38.3796 51.9184 55.9826 69.7643 75.9390 84.8160 113.3014 130.0796 139.7063 168.3203 172.9140 178.6363 182.3053 186.2180 212.7152 227.1078 234.6573 255.4980 279.6330 314.7530 322.9644 324.4550 334.8696 343.2032 351.3174 383.3829 405.3323 447.3302 455.4575 456.7982 468.3853 501.9437 523.7581 531.4105 543.9777 567.2367 578.7025 584.3860 624.0696 632.0795 640.5222 656.2442 686.4703 687.4686 726.2576 727.1616 763.8567 770.0686 781.4678 813.9446 832.8551 842.9889 874.1339 879.5925 882.7328 898.0021 926.5299 950.9605 957.0252 959.5109 969.3352 975.2310 1002.2639 1003.4622 1007.0858 1009.1191 1010.3722 1027.1919 1036.7396 1037.7005 1044.2253 1071.8113 1081.1140 1095.8618 1122.5044 1125.6925 1150.8300 1168.9871 1172.8417 1174.1239 1197.6294 1219.9611 1226.9929 1237.7537 1254.8839 1284.1130 1286.1000 1289.5242 1316.5856 1322.1557 1327.1238 1336.8966 1341.3116 1365.5312 1380.6884 1381.4814 1424.1531 1426.3779 1438.1804 1442.7878 1460.0491 1460.1808 1473.6615 1490.6412 1509.1056 1542.7489 1558.2700 1562.4164 1579.1751 1585.8387 1604.7628 1605.5725 1623.6490 1625.9736 2969.5904 2983.1033 2995.1043 2998.1642 3012.0315 3022.1868 3032.3687 3047.2811 3061.8505 3065.6392 3136.2380 3143.3317 3151.3179 3155.4160 3164.3383 3169.1388 3175.4034 3180.2841 3217.6223 3371.1832
redmass: 10.1802 7.0249 7.5725 8.4164 7.5879 5.9807 4.7473 4.5542 7.8408 5.0104 7.1107 4.7235 5.3646 11.1009 4.7552 5.0794 6.4575 5.8660 2.3336 2.9328 3.3909 3.1805 3.0962 4.0328 5.0184 4.3547 5.4381 6.0213 7.7153 6.4148 7.6330 5.8097 3.4221 3.3920 5.8916 5.6622 3.0760 3.3569 3.0116 3.6770 4.7252 4.3210 6.1818 5.1444 1.2018 3.0729 6.6000 6.3153 3.8663 3.8227 1.2477 1.2421 1.6018 2.9022 4.0134 3.8759 1.3128 1.4097 1.3397 1.5319 3.2330 1.4995 1.3926 3.8231 1.3894 1.4757 2.2606 1.3561 2.2818 2.2141 6.4314 5.3541 2.0195 2.0304 2.5509 3.6744 2.9790 2.3330 1.7038 1.6712 1.6587 1.0643 1.0653 1.2193 1.9918 2.0202 1.6481 1.7898 1.4724 1.4136 1.6390 1.5687 1.2568 1.4984 1.3993 1.7407 1.9100 1.4724 3.5422 4.5387 2.5094 2.4242 1.0975 1.0791 2.4458 2.5828 1.0910 1.1012 1.9642 4.5356 6.1291 3.0378 2.6201 6.1977 6.2681 6.8920 4.7135 5.6395 1.0597 1.0623 1.0624 1.0643 1.0882 1.0976 1.0969 1.0983 1.1030 1.0896 1.0858 1.0863 1.0904 1.0908 1.0955 1.0958 1.0997 1.0997 1.0831 1.0757
irintensity: 0.2854 0.5022 0.0935 2.1497 3.2892 1.8579 5.0481 3.2287 4.2055 2.3759 9.1002 0.5349 0.6817 1.2168 1.9834 0.3971 2.0500 1.7967 16.0209 9.4822 5.8487 16.3730 2.4372 4.7228 5.3600 0.8642 1.4833 5.2434 0.4581 16.0760 3.6757 3.3830 7.2482 11.0225 0.8236 6.4589 0.2168 0.5939 1.0823 6.3058 1.2741 1.7804 8.4605 2.7938 76.3361 5.0785 43.9776 19.0142 5.5305 3.7637 76.7519 77.2204 38.9102 4.2622 1.7703 0.9563 18.3195 4.7684 0.6173 48.1532 9.7239 24.5856 2.4609 37.3363 6.1205 57.2640 6.0723 3.8888 45.6134 49.7122 63.3899 15.0432 15.0391 7.8654 4.7063 17.3492 40.2278 78.3467 7.8246 6.7686 47.4891 1.2419 0.1183 62.7209 247.8820 81.2332 64.1117 189.0267 46.9380 4.4650 7.2984 70.8980 3.0679 37.0167 0.6975 33.3842 50.4345 0.2587 0.1662 4.8569 54.3857 38.1105 31.1750 16.8108 40.6818 8.1149 27.0491 25.0687 249.8509 112.6835 6.0300 100.6954 211.8737 29.2557 8.3705 28.6424 526.5734 58.3029 27.0012 28.9162 23.0748 18.4918 31.8196 18.0776 13.0119 21.5566 70.0930 6.8297 2.5784 2.6206 9.0120 4.3931 7.5147 4.0296 23.1217 13.8599 717.8475 14.0035
temp: 298.150 k
press: 1.00000 atm
elementType: 17 17 8 8 7 7 7 7 6 6 6 6 6 6 6 6 6 6 6 6 6 6 6 6 6 6 6 6 1 1 1 1 1 1 1 1 1 1 1 1 1 1 1 1 1 1 1 1
symmnumber: 1
zpe: 959443.7 jmol-1
zpe.correction: 0.365433 hartree
zpe.thermalcorrener: 0.392297 hartree
zpe.thermalcorrenthalpy: 0.393241 hartree
zpe.thermalcorrgfe: 0.303544 hartree
zpe.sumelectzpe: -2061.646384 hartree
zpe.sumelectthermal: -2061.619520 hartree
zpe.sumelectthermalent: -2061.618576 hartree
zpe.sumelectthermalfe: -2061.708273 hartree
dipole: 7.6061 -2.8241 -0.8001
dipole: 8.1528
quadrupole: -206.3932 -129.7547 -180.5843
quadrupole: -6.3615 3.0574 6.8115
quadrupole: -34.1491 42.4893 -8.3402 -6.3615 3.0574 6.8115
hfenergy: -2062.0118169 hartree
pointgroup: C01 [X(C20H20Cl2N4O2)]
dipole: -0.1808613 2.9033814 -1.3513536 debye
polarizability: 442.0810015|-29.1076479|335.1257055|-5.0153161|-84.1897022|164.6358723 unknown
InChI: InChI=1S/C20H20Cl2N4O2/c21-17-9-3-1-7-15(17)13-23-25-19(27)11-5-6-12-20(28)26-24-14-16-8-2-4-10-18(16)22/h1-4,7-10,13-14,25-26H,5-6,11-12H2
charge 0 multiplicity 1
48 atoms
Cl -1.591361 6.334889 -2.491364
Cl -2.452453 -1.106641 -0.111516
O  1.727863 0.327695 -0.276253
O  4.050754 -3.764463 1.682023
N  1.590398 2.384754 -1.359525
N  2.547237 -2.105937 0.968294
N  0.25029 2.539821 -1.042868
N  1.440764 -2.917898 1.164021
C  4.439079 -0.109592 -0.932443
C  4.704724 -0.162606 0.59604
C  3.749934 1.195062 -1.389739
C  4.987856 -1.587073 1.127195
C  2.280898 1.243989 -0.947053
C  3.82509 -2.592322 1.276292
C  -1.772816 3.839414 -1.165131
C  -0.942935 -3.216663 1.036007
C  -0.350328 3.632856 -1.463753
C  0.267778 -2.40921 0.830089
C  -2.467345 5.010387 -1.568903
C  -2.237018 -2.759034 0.672509
C  -2.519033 2.851908 -0.452495
C  -0.86651 -4.516596 1.625074
C  -3.830775 5.214883 -1.291004
C  -3.402407 -3.522149 0.871203
C  -3.882266 3.03679 -0.166663
C  -2.01703 -5.296381 1.833244
C  -4.542189 4.219397 -0.584439
C  -3.291444 -4.802297 1.458031
H  5.401722 -0.212566 -1.468432
H  3.815735 -0.968565 -1.243317
H  5.584001 0.472646 0.823045
H  3.858264 0.282829 1.15212
H  4.287448 2.076556 -0.983374
H  3.790932 1.282736 -2.494416
H  5.439717 -1.527591 2.136343
H  5.746214 -2.090331 0.496186
H  2.093524 3.098771 -1.910322
H  2.411145 -1.15717 0.562574
H  0.164548 4.421465 -2.044049
H  0.147055 -1.399727 0.404592
H  -1.99106 1.945499 -0.139329
H  0.129064 -4.875099 1.905836
H  -4.325264 6.132774 -1.620358
H  -4.375654 -3.123837 0.570641
H  -4.432064 2.263142 0.378452
H  -1.926681 -6.288851 2.28734
H  -5.604318 4.370285 -0.365315
H  -4.192585 -5.403847 1.617312
