program: Gaussian 09
title: 000241298
version: EM64L-G09RevD.01
frameworkgroup: C1[X(C12H14O4)]
method: RPBEPBE
basis: SDD
operation: Freq
keyword: #pfreq=noraman
keyword: PBEPBE/SDD
title: #p freq=noraman PBEPBE/SDD
converged: YES YES NO NO
title: Mulliken charges:
elementType: O O O O C C C C C C C C C C C C H H H H H H H H H H H H H H
charge: -0.289030 -0.249291 -0.294841 -0.218160 -0.020689 -0.149623 -0.348500 0.396945 -0.708804 -0.479116 -0.384362 0.403744 -0.189747 -0.397224 0.247152 -0.745047 0.223801 0.246901 0.217036 0.234318 0.207289 0.267664 0.232606 0.304227 0.252957 0.231699 0.254976 0.253024 0.246643 0.253449
chargesum: 0.00000
title: Mulliken charges with hydrogens summed into heavy atoms:
elementType: O O O O C C C C C C C C C C C C
charge: -0.289030 -0.249291 -0.294841 -0.218160 0.203112 0.097279 0.102854 0.396945 -0.001245 -0.174889 -0.131405 0.403744 0.041952 -0.142248 0.247152 0.008070
polarizability: 1.65674090e+02 -4.16115523e+00 1.57702529e+02 -3.31512815e-01 -5.25985453e+00 9.10360010e+01
1716.lowfreq: -12.3287 -0.0006 -0.0006 -0.0005 4.1747 6.6240 24.0509 34.5680 51.3743
frequency: 23.0999 34.5262 51.3722 57.9450 82.3926 96.8367 112.0221 187.4769 203.4134 238.2130 256.5870 300.5644 318.2309 329.9578 355.8631 420.5922 440.0202 455.4033 514.5674 532.7909 559.4517 596.1782 621.5789 658.0843 689.3536 708.6944 744.8525 771.1559 808.5669 845.2256 860.0784 883.6588 908.1744 914.3563 927.3404 953.4568 956.5022 980.1263 988.0034 995.1370 1015.7384 1039.9161 1060.9260 1082.7145 1127.4279 1131.2384 1137.6396 1172.3478 1174.6006 1193.7334 1218.7371 1243.0637 1281.3359 1298.9226 1303.3653 1306.7665 1353.6282 1384.1257 1390.2902 1397.4431 1428.6571 1452.3040 1452.9842 1466.0478 1471.0049 1471.8283 1487.1130 1598.6260 1611.0606 1666.8888 2984.4375 2987.3233 3007.6903 3009.2960 3041.3856 3079.4381 3097.0845 3100.5145 3111.2896 3136.5308 3145.1050 3154.7108 3172.7036 3193.7745
redmass: 3.9845 1.8878 2.5114 4.4370 2.2901 4.6041 3.5987 6.1279 3.4993 1.1346 4.8788 4.0344 2.8451 3.7518 7.0146 3.6625 2.6886 3.5641 4.7704 4.4442 3.3698 3.9201 6.2335 6.4989 3.3458 4.4059 3.1588 3.4770 1.8276 5.0448 4.4824 2.1336 2.2825 1.9266 1.8571 2.2198 1.7505 1.3582 4.4051 2.4079 3.5551 1.6512 2.5815 1.5996 1.8255 1.7244 2.1095 1.5265 1.9240 1.2936 2.7934 1.3501 1.2757 1.2692 1.2644 1.2373 1.4804 1.2578 7.9746 1.2269 2.9282 1.0609 1.0477 1.0644 2.4039 1.0962 1.0523 6.9494 6.7421 9.9255 1.0543 1.0505 1.0847 1.0368 1.0876 1.0974 1.0972 1.1011 1.1002 1.0867 1.1012 1.0933 1.0982 1.0921
irintensity: 0.2759 3.4062 1.2583 2.7740 2.3612 2.2732 0.7744 2.4098 6.5312 0.4247 3.2161 0.3534 2.5366 7.6717 3.2114 2.7019 2.9497 3.7711 9.9660 2.7717 1.2223 6.2236 12.1180 2.7164 17.2377 9.2865 30.6278 13.1105 64.2353 36.2306 76.6374 1.1195 16.4680 3.5544 20.7196 11.7790 12.4596 1.7943 32.9453 59.8533 91.0369 9.5883 68.3191 3.1086 82.5661 4.9399 33.1852 196.8709 252.7300 10.2465 35.2622 8.7076 17.3664 3.8056 14.3579 12.0290 3.1976 54.1590 7.5810 20.4919 45.6214 29.3588 18.2608 4.1245 17.2652 12.8458 11.6518 24.0950 6.2641 178.7875 9.1535 40.2000 59.8045 1.2963 28.0886 19.9535 5.9417 15.9709 35.7064 4.8437 9.6464 11.9331 10.7258 4.9300
temp: 298.150 k
press: 1.00000 atm
elementType: 8 8 8 8 6 6 6 6 6 6 6 6 6 6 6 6 1 1 1 1 1 1 1 1 1 1 1 1 1 1
symmnumber: 1
zpe: 622199.4 jmol-1
zpe.correction: 0.236983 hartree
zpe.thermalcorrener: 0.252408 hartree
zpe.thermalcorrenthalpy: 0.253352 hartree
zpe.thermalcorrgfe: 0.192222 hartree
zpe.sumelectzpe: -765.360459 hartree
zpe.sumelectthermal: -765.345035 hartree
zpe.sumelectthermalent: -765.344091 hartree
zpe.sumelectthermalfe: -765.405220 hartree
dipole: 1.8121 -0.1307 -0.9193
dipole: 2.0362
quadrupole: -82.6139 -86.9305 -95.7338
quadrupole: 2.0233 2.8645 -0.8664
quadrupole: 5.8122 1.4956 -7.3077 2.0233 2.8645 -0.8664
hfenergy: -765.5974425 hartree
pointgroup: C01 [X(C12H14O4)]
dipole: 0.7054218 0.2450813 0.2899622 debye
polarizability: 163.0328693|4.8278447|159.01204|-4.4754069|-10.3129413|92.3677103 unknown
InChI: InChI=1S/C12H14O4/c1-8-7-14-12(15-8)10-4-3-5-11(6-10)16-9(2)13/h3-6,8,12H,7H2,1-2H3
charge 0 multiplicity 1
30 atoms
O  -2.487735 0.385847 -1.135829
O  -3.049328 -1.177026 0.532472
O  2.58973 0.498892 -0.623436
O  1.386216 2.347839 0.202534
C  -3.090253 1.150352 0.012549
C  -2.230579 -0.985465 -0.680133
C  -3.008933 0.149194 1.19184
C  -0.746681 -1.221933 -0.388538
C  -2.337145 2.464787 0.223643
C  0.209918 -0.223944 -0.673202
C  -0.338413 -2.455737 0.17717
C  1.559611 -0.459666 -0.343708
C  1.024189 -2.683077 0.468694
C  1.986776 -1.679099 0.215679
C  2.40979 1.874239 -0.327371
C  3.648035 2.633087 -0.746449
H  -4.14524 1.338004 -0.264294
H  -2.627608 -1.692457 -1.429366
H  -2.063675 0.274814 1.756622
H  -3.87224 0.19184 1.872278
H  -2.80526 3.043774 1.042381
H  -1.277336 2.288492 0.476567
H  -2.376681 3.080987 -0.691182
H  -0.116357 0.712389 -1.129399
H  -1.089196 -3.219883 0.405666
H  1.34084 -3.637133 0.903365
H  3.046664 -1.828217 0.442692
H  4.530971 2.241868 -0.212089
H  3.521109 3.702271 -0.52523
H  3.831011 2.491563 -1.825623
