program: Gaussian 09
title: 000241286
version: EM64L-G09RevD.01
frameworkgroup: C1[X(C16H32O2)]
method: RPBEPBE
basis: SDD
operation: Freq
keyword: #pfreq=noraman
keyword: PBEPBE/SDD
title: #p freq=noraman PBEPBE/SDD
converged: YES YES NO NO
title: Mulliken charges:
elementType: O O C C C C C C C C C C C C C C C C H H H H H H H H H H H H H H H H H H H H H H H H H H H H H H H H
charge: -0.256865 -0.239399 -0.382372 -0.444153 -0.379010 0.012289 -0.387392 -0.385565 -0.384268 0.029435 -0.388274 -0.382199 -0.328910 -0.372469 -0.353485 -0.715662 -0.356565 -0.696938 0.180086 0.229526 0.226332 0.212420 0.190070 0.197909 0.176798 0.191856 0.196436 0.192720 0.194393 0.192112 0.193257 0.181401 0.196040 0.226207 0.192124 0.191451 0.231042 0.180866 0.189231 0.188855 0.187629 0.187461 0.228030 0.201477 0.233122 0.194581 0.194558 0.214536 0.209579 0.209698
chargesum: 0.00000
title: Mulliken charges with hydrogens summed into heavy atoms:
elementType: O O C C C C C C C C C C C C C C C C
charge: -0.256865 -0.239399 0.027240 -0.005401 0.008968 0.189087 0.000901 0.001547 0.001102 0.210836 0.033973 0.001375 0.082997 0.005617 0.021605 -0.053033 0.032574 -0.063125
polarizability: 2.41571295e+02 -2.95671031e-01 1.59664781e+02 3.70048482e-01 1.50794542e+00 1.45808614e+02
1716.lowfreq: -16.3426 -1.2554 -0.0014 0.0003 0.0017 6.0478 16.1259 20.7181 24.1004
frequency: 4.8296 20.2965 23.9607 40.1051 56.5293 61.3385 71.8064 95.1629 107.6958 117.0733 129.1051 134.4969 143.8592 151.9696 156.1132 174.7000 200.6808 218.8593 223.5791 266.1488 282.2164 288.0703 333.4342 383.1058 406.0262 418.7967 457.6879 474.0410 489.1521 505.1492 545.7641 632.5891 717.6104 719.9204 724.4624 734.2141 754.1721 785.0679 796.7733 826.5051 854.3858 870.1057 881.3891 887.4046 925.7788 932.0937 960.7277 974.2799 981.7440 983.3192 997.0740 1020.4964 1023.2956 1031.2202 1042.0215 1062.2976 1075.5532 1077.6717 1081.0236 1082.0936 1083.7399 1097.1465 1123.2883 1131.8357 1153.7850 1173.0458 1183.9160 1204.2418 1206.0041 1207.1866 1224.3338 1234.5133 1237.7195 1260.2976 1261.6480 1276.1685 1279.6063 1284.3428 1286.1721 1290.4723 1294.4764 1296.3679 1297.8829 1300.5191 1315.1674 1334.9272 1342.2346 1350.0214 1353.1223 1355.3668 1356.5693 1359.2427 1363.1568 1384.1396 1388.1316 1392.4538 1433.5127 1451.2470 1458.5922 1459.1632 1459.3555 1462.7364 1463.0993 1464.2243 1466.8327 1472.1595 1475.4797 1477.7585 1478.8875 1482.9114 1486.8711 1488.8678 2865.8691 2907.5131 2931.3286 2948.0105 2948.3302 2949.9996 2950.3971 2952.6950 2956.8799 2961.4740 2964.9727 2967.5009 2970.9965 2980.8388 2984.2360 2989.1162 2989.6153 2992.6633 2997.3124 3000.3625 3007.3478 3018.6224 3029.0771 3037.2323 3042.5247 3062.5347 3067.4553 3069.3035 3069.3610 3084.6997 3089.2231 3097.9603
redmass: 1.9998 2.8775 3.9283 3.7885 1.9641 2.5325 3.3395 1.7677 2.5705 3.3647 1.8533 4.4843 2.2020 2.2916 2.5945 2.3906 1.3465 2.2891 1.1321 3.2349 3.4546 2.0491 3.0150 2.9662 3.4086 4.7612 2.9504 2.5666 3.4706 2.6931 3.1469 3.0681 1.0587 1.0703 1.1262 1.2269 1.3430 1.4632 2.4859 1.4108 2.4096 1.6344 2.0265 1.9006 1.4685 2.6750 1.5254 1.4639 2.4249 1.9790 3.9842 3.1522 1.1569 3.5903 3.4944 3.0404 2.5877 2.2639 2.0921 2.5023 2.1701 2.0966 2.7921 1.9661 1.9202 2.1119 1.8269 1.3099 1.4650 1.4222 1.2945 1.3070 1.3661 1.3017 1.2837 1.0171 1.1837 1.0922 1.2233 1.0969 1.1254 1.1186 1.2193 1.2267 1.3275 1.3770 1.2635 1.4545 1.6907 1.5409 1.6212 1.6290 1.3141 1.4197 1.2180 1.5231 1.0964 1.0831 1.0473 1.0738 1.0723 1.0652 1.0710 1.0945 1.0795 1.0828 1.0430 1.0836 1.0502 1.0888 1.0935 1.0951 1.0825 1.0830 1.0696 1.0585 1.0585 1.0591 1.0590 1.0595 1.0597 1.0606 1.0625 1.0586 1.0365 1.0959 1.0968 1.0432 1.0982 1.0530 1.0988 1.0619 1.1016 1.1030 1.1029 1.1026 1.1036 1.1008 1.1006 1.0993 1.1029 1.0956 1.0993 1.1001
irintensity: 0.0551 0.0840 0.2630 0.3008 0.1827 0.3934 0.3840 0.0567 0.8549 0.4664 0.0590 0.2525 0.2529 0.5548 0.8762 1.5033 0.2520 2.6766 0.0235 0.6655 0.5900 3.6318 1.2531 1.3737 2.7553 1.7033 2.2973 1.6977 1.9850 4.3725 1.9010 2.1971 18.1358 0.3010 3.5727 6.0879 5.1655 13.9279 7.1738 7.3698 7.6899 2.5424 36.8291 5.3201 26.9093 53.8474 11.6380 13.7261 2.3246 5.5841 14.9658 1.8997 0.6717 21.4578 6.7098 6.1997 7.4278 18.1114 0.3461 36.5680 4.6453 77.0237 13.9576 17.5688 35.0563 4.6325 1.7513 18.2667 2.5853 4.3331 7.4833 0.8361 4.3657 0.6757 1.1107 0.3063 1.2891 2.8461 1.4912 2.2752 0.2715 1.5931 19.0420 4.2543 1.5485 5.0051 25.2486 2.2932 0.8679 8.4205 3.5742 4.8827 0.2707 32.1553 11.1331 10.6161 9.1485 5.2607 10.9395 0.0024 0.1524 0.3142 0.0431 9.9881 0.3185 0.4208 12.2197 1.1142 7.8766 1.2751 3.1834 39.2142 64.1348 47.6186 88.9398 0.2071 0.1398 0.3564 0.2126 3.2650 1.1647 23.5427 79.4803 224.5037 37.6413 0.6361 0.9449 10.0799 1.2725 50.8002 0.9503 24.8473 2.5599 6.0859 1.0629 27.0620 225.4844 26.6373 94.2848 53.4012 72.6854 33.8975 36.2575 31.9909
temp: 298.150 k
press: 1.00000 atm
elementType: 8 8 6 6 6 6 6 6 6 6 6 6 6 6 6 6 6 6 1 1 1 1 1 1 1 1 1 1 1 1 1 1 1 1 1 1 1 1 1 1 1 1 1 1 1 1 1 1 1 1
symmnumber: 1
zpe: 1187098.9 jmol-1
zpe.correction: 0.452142 hartree
zpe.thermalcorrener: 0.474689 hartree
zpe.thermalcorrenthalpy: 0.475633 hartree
zpe.thermalcorrgfe: 0.395639 hartree
zpe.sumelectzpe: -777.835421 hartree
zpe.sumelectthermal: -777.812875 hartree
zpe.sumelectthermalent: -777.811931 hartree
zpe.sumelectthermalfe: -777.891924 hartree
dipole: 1.6873 0.9457 1.4224
dipole: 2.4009
quadrupole: -96.7266 -115.8918 -113.9296
quadrupole: 7.5476 6.3063 -0.5764
quadrupole: 12.1227 -7.0424 -5.0803 7.5476 6.3063 -0.5764
hfenergy: -778.2875635 hartree
pointgroup: C01 [X(C16H32O2)]
dipole: 0.6636516 0.3478104 0.5752013 debye
polarizability: 241.5718269|-0.2484112|159.5065603|0.3410099|2.1063455|145.9663027 unknown
InChI: InChI=1S/C16H32O2/c1-3-4-5-6-7-8-9-10-11-12-16-17-14-13-15(2)18-16/h15-16H,3-14H2,1-2H3
charge 0 multiplicity 1
50 atoms
O  5.221579 -0.956588 -0.065228
O  4.227343 1.229546 -0.382484
C  1.559223 0.045032 0.311882
C  2.813928 -0.726443 -0.152123
C  0.246886 -0.603649 -0.180826
C  4.113767 -0.068209 0.292002
C  -1.01694 0.143207 0.30146
C  -2.333092 -0.48312 -0.211472
C  -3.597059 0.248786 0.293482
C  6.532678 -0.372555 0.332051
C  6.69614 1.009427 -0.339078
C  -4.913795 -0.364379 -0.23392
C  5.485205 1.899925 0.002674
C  -6.177654 0.356283 0.287649
C  -7.494923 -0.247403 -0.249447
C  7.598611 -1.390601 -0.068865
C  -8.758259 0.46932 0.280039
C  -10.069835 -0.134944 -0.266659
H  1.545206 0.098514 1.421235
H  1.623156 1.087447 -0.054237
H  2.835381 -0.799725 -1.255606
H  2.804711 -1.758399 0.247049
H  0.202386 -1.658557 0.163338
H  0.2513 -0.638926 -1.290272
H  4.148865 0.113702 1.397027
H  -1.029251 0.162807 1.411618
H  -0.962909 1.202362 -0.026638
H  -2.378295 -1.548048 0.09974
H  -2.329073 -0.484712 -1.321686
H  -3.60699 0.237664 1.403756
H  -3.545501 1.316987 -0.005047
H  6.523131 -0.236088 1.439932
H  7.632425 1.491628 0.004956
H  6.756357 0.871635 -1.434381
H  -4.909904 -0.340142 -1.343922
H  -4.95941 -1.436252 0.05227
H  5.494323 2.849959 -0.555051
H  5.465876 2.120803 1.094517
H  -6.127591 1.430263 0.010113
H  -6.185662 0.323309 1.39753
H  -7.491228 -0.208377 -1.359086
H  -7.544301 -1.322843 0.022431
H  7.573078 -1.557993 -1.160036
H  8.605455 -1.030172 0.210409
H  7.417188 -2.356981 0.432055
H  -8.705139 1.544629 0.01241
H  -8.763382 0.42569 1.388522
H  -10.95678 0.395042 0.127161
H  -10.16144 -1.201566 0.013251
H  -10.103093 -0.075395 -1.371094
