program: Gaussian 09
title: 000020913
version: EM64L-G09RevD.01
frameworkgroup: C1[X(C4H5N)]
method: RPBEPBE
basis: SDD
operation: Freq
keyword: #p
keyword: freq=noraman
keyword: PBEPBE/SDD
title: #p freq=noraman PBEPBE/SDD
converged: NO NO NO NO
title: Mulliken charges:
elementType: N C C C C H H H H H
charge: -0.025438 -0.716089 -0.083920 -0.218312 -0.160249 0.239239 0.230434 0.239238 0.245251 0.249846
chargesum: 0.00000
title: Mulliken charges with hydrogens summed into heavy atoms:
elementType: N C C C C
charge: -0.025438 -0.007178 0.161331 0.031535 -0.160249
polarizability: 8.20148603e+01 -2.82007963e+00 3.80252998e+01 1.27747144e-03 9.85346933e-04 2.61807255e+01
1716.lowfreq: -0.0007 0.0001 0.0005 3.8998 15.8122 39.2458 171.0783 176.3861 189.9417
frequency: 171.0722 176.3832 189.8359 387.7655 482.8326 546.8868 805.1716 898.3483 969.6612 1033.1922 1047.2600 1122.4860 1281.4199 1297.9930 1396.5877 1456.1985 1464.9506 1652.5120 2165.9470 2970.6549 3045.4510 3086.4394 3115.0907 3125.4374
redmass: 3.0094 4.7833 1.2243 3.2560 4.4661 6.8137 1.6739 1.7927 1.0645 3.2906 1.5917 2.3289 1.3080 1.2380 1.2257 1.0467 1.0714 5.6479 12.5106 1.0370 1.0962 1.0982 1.0962 1.0867
irintensity: 0.0001 2.1938 2.3390 0.7298 1.8091 0.5102 0.0474 12.0993 69.1621 10.8223 0.0653 0.3058 0.0041 1.6996 16.8976 17.8641 26.8231 23.4420 25.3208 13.7376 15.8295 11.2419 8.4119 18.0002
temp: 298.150 k
press: 1.00000 atm
elementType: 7 6 6 6 6 1 1 1 1 1
symmnumber: 1
zpe: 202704.7 jmol-1
zpe.correction: 0.077206 hartree
zpe.thermalcorrener: 0.082876 hartree
zpe.thermalcorrenthalpy: 0.083820 hartree
zpe.thermalcorrgfe: 0.048857 hartree
zpe.sumelectzpe: -209.769429 hartree
zpe.sumelectthermal: -209.763759 hartree
zpe.sumelectthermalent: -209.762815 hartree
zpe.sumelectthermalfe: -209.797778 hartree
dipole: 4.8127 0.5338 0.0002
dipole: 4.8422
quadrupole: -37.9179 -27.1754 -31.0505
quadrupole: -2.0102 -0.0003 0.0003
quadrupole: -5.8699 4.8725 0.9975 -2.0102 -0.0003 0.0003
hfenergy: -209.8466351 hartree
pointgroup: C01 [X(C4H5N1)]
dipole: -1.8943582 0.2017968 -0.0000796 debye
dipolederiv: -0.4244345 -0.037851 0.0000104 0.0494205 -0.2237718 -0.0000054 -0.0000051 -0.0000041 -0.2608504 -0.3016185 0.0129716 -0.0000112 -0.0838734 0.0376346 -0.0000015 -0.0000068 0.0000016 0.0498113 0.5061397 0.0545383 0.0000157 0.0715845 0.1500399 -0.0000238 0.0000249 -0.0000213 -0.1603001 -0.2949535 -0.0323617 -0.000005 -0.2108108 0.1830168 -0.0000383 0.0000012 -0.0000385 -0.1165102 0.3723265 -0.0135096 -0.0000029 -0.0702117 -0.0856629 0.0000162 0.0000099 0.0000141 0.058943 0.0035077 -0.0321548 0.0745084 0.0235192 0.0873961 0.0889796 0.1138763 0.0777963 -0.0245486 0.0646814 -0.0208827 0.0000004 0.0757402 -0.1353712 0.0000243 -0.0000085 0.000022 0.1160085 0.0035187 -0.0321631 -0.0745008 0.0235053 0.0873668 -0.0889979 -0.1138784 -0.0778185 -0.0245297 0.0311344 0.0564328 -0.0000089 0.0695956 -0.0718285 0.0000223 -0.0000112 0.0000198 0.1695735 0.0396981 0.04498 -0.0000061 0.0515306 -0.0288197 0.0000246 -0.0000024 0.0000285 0.1924026 unknown
polarizability: 81.9896079|3.0104907|38.0505522|0.0012817|-0.0009798|26.1807255 unknown
InChI: InChI=1S/C4H5N/c1-2-3-4-5/h2-3H,1H3
charge 0 multiplicity 1
10 atoms
N  2.478022 -0.19752 0.000085
C  -2.549959 -0.006735 -0.000065
C  -1.095216 -0.392149 0.000014
C  -0.061426 0.500494 -0.000038
C  1.318882 0.107366 0.000011
H  -3.063179 -0.425918 0.8873
H  -2.689589 1.087967 -0.000167
H  -3.063129 -0.426074 -0.887386
H  -0.862584 -1.466781 0.000107
H  -0.257521 1.580651 -0.000159
