program: Gaussian 09
title: 000241276
version: EM64L-G09RevD.01
frameworkgroup: C1[X(C11H13NO4)]
method: RPBEPBE
basis: SDD
operation: Freq
keyword: #p
keyword: freq=noraman
keyword: PBEPBE/SDD
title: #p freq=noraman PBEPBE/SDD
converged: YES YES NO NO
title: Mulliken charges:
elementType: O O O O N C C C C C C C C C C C H H H H H H H H H H H H H
charge: -0.273917 -0.241610 -0.210445 -0.204616 0.019335 0.033538 -0.393251 -0.049959 -0.327529 0.397796 -0.714176 -0.502607 -0.398653 0.384133 -0.180980 -0.372165 0.189933 0.203761 0.232920 0.192308 0.240505 0.187735 0.232613 0.207530 0.231251 0.314676 0.276408 0.238551 0.286912
chargesum: 0.00000
title: Mulliken charges with hydrogens summed into heavy atoms:
elementType: O O O O N C C C C C C C C C C C
charge: -0.273917 -0.241610 -0.210445 -0.204616 0.019335 0.223471 0.043430 0.142350 0.100711 0.397796 -0.042781 -0.187931 -0.122245 0.384133 0.057571 -0.085253
polarizability: 1.95717102e+02 1.92776667e+00 1.51437391e+02 6.13918325e+00 -2.90295699e+00 7.79654744e+01
1716.lowfreq: -4.9151 0.0005 0.0006 0.0008 8.1528 13.4230 21.9887 51.0736 83.8263
frequency: 21.0491 51.0642 83.8229 88.2612 153.9724 163.4989 187.9009 200.4656 220.3014 267.1967 289.8267 303.5087 364.9267 411.7942 419.9532 425.8600 460.9336 488.4099 499.9731 524.9820 621.2457 632.9999 663.4622 688.3524 703.4146 769.2285 804.0024 823.1505 854.2030 865.4695 886.8908 919.9227 946.9738 959.6007 967.1712 977.4597 989.7993 997.2848 1006.4050 1041.2351 1079.0992 1085.8169 1089.6654 1147.6004 1151.3525 1173.9745 1205.7438 1207.3359 1223.3848 1226.3400 1282.9506 1293.5818 1303.3948 1334.9408 1351.5847 1358.3710 1368.4952 1373.0676 1392.6750 1401.0430 1431.1117 1433.7901 1461.0479 1463.1003 1479.2639 1481.3523 1591.7667 1621.2330 2852.1377 2917.8754 2941.5093 2992.7001 2998.7686 3068.5731 3092.4657 3096.7665 3100.1209 3150.7355 3177.0312 3187.5333 3192.7795
redmass: 4.8003 10.6947 4.3265 5.4501 3.3245 5.0793 4.5306 1.9120 1.5695 6.7653 2.2685 3.0551 5.6863 4.2941 5.4877 3.4405 3.1203 3.8393 3.8093 5.2687 4.2758 5.1557 5.9295 3.2964 4.1111 6.5327 2.1824 1.7610 3.2994 2.7041 2.8000 4.9341 2.0194 1.5278 1.3963 1.5835 5.3092 2.8063 1.3634 4.1280 2.4923 1.7476 1.7471 2.2198 1.8710 1.1324 2.8639 1.3655 1.3937 2.8019 1.3052 1.1723 1.2871 1.2939 1.3899 1.3299 2.8345 2.9622 1.3007 6.8603 2.8478 1.1031 1.0475 1.0921 1.0505 3.0397 7.0520 7.0491 1.0803 1.0834 1.0695 1.0373 1.0592 1.1013 1.0992 1.0960 1.1003 1.0884 1.0930 1.0968 1.0928
irintensity: 0.7103 0.0961 3.1016 1.2234 1.1726 2.4992 2.5030 0.6276 0.3111 1.6051 2.2296 1.6737 0.4705 4.8503 2.3906 1.2819 3.4089 1.2331 1.5302 1.5366 7.4455 0.5813 16.9266 16.8557 34.7333 21.2182 24.5959 25.3250 1.7488 15.4297 16.9465 90.3996 26.0326 1.5605 7.3915 11.3046 4.0198 40.7834 0.8583 66.5096 137.8832 49.3111 3.6144 6.6364 34.3402 24.4871 103.6861 6.7926 27.5591 171.9434 0.9745 38.6630 4.3027 34.2408 13.1914 1.9598 17.5501 131.8251 25.7201 0.6306 17.4324 9.7164 11.0579 13.7155 6.8830 21.4363 8.9349 1.2122 60.5737 42.8246 81.3336 13.6112 38.7289 24.4708 32.6251 18.4022 34.5535 8.4766 1.9076 2.5144 8.1024
temp: 298.150 k
press: 1.00000 atm
elementType: 8 8 8 8 7 6 6 6 6 6 6 6 6 6 6 6 1 1 1 1 1 1 1 1 1 1 1 1 1
symmnumber: 1
zpe: 595310.0 jmol-1
zpe.correction: 0.226742 hartree
zpe.thermalcorrener: 0.240970 hartree
zpe.thermalcorrenthalpy: 0.241914 hartree
zpe.thermalcorrgfe: 0.184502 hartree
zpe.sumelectzpe: -781.325483 hartree
zpe.sumelectthermal: -781.311255 hartree
zpe.sumelectthermalent: -781.310311 hartree
zpe.sumelectthermalfe: -781.367723 hartree
dipole: 7.1603 2.1030 1.5556
dipole: 7.6232
quadrupole: -100.0162 -89.8088 -93.2260
quadrupole: -15.0844 1.3010 -0.9166
quadrupole: -5.6658 4.5415 1.1243 -15.0844 1.3010 -0.9166
hfenergy: -781.552225 hartree
pointgroup: C01 [X(C11H13N1O4)]
dipole: 2.6337303 -0.0583452 1.4336077 debye
polarizability: 191.3846158|-12.6575661|112.491392|18.2946603|34.96033|121.2439601 unknown
InChI: InChI=1S/C11H13NO4/c1-8-5-6-15-11(16-8)9-3-2-4-10(7-9)12(13)14/h2-4,7-8,11H,5-6H2,1H3
charge 0 multiplicity 1
29 atoms
O  2.236649 0.431944 0.746385
O  1.513318 -0.860807 -1.175981
O  -4.675771 0.330565 -1.220142
O  -3.23099 -1.135516 -2.199309
N  -3.509609 -0.212944 -1.340369
C  3.608821 -0.156475 0.706509
C  3.936911 -0.56369 -0.747361
C  1.254324 -0.509811 0.218898
C  2.842771 -1.501198 -1.293459
C  -0.122358 0.119066 0.306211
C  4.546802 0.898441 1.287606
C  -1.14624 -0.321801 -0.558758
C  -0.394436 1.11958 1.270749
C  -2.428592 0.250369 -0.433021
C  -1.688948 1.678758 1.374664
C  -2.724862 1.247029 0.522463
H  3.601446 -1.069171 1.348049
H  4.921249 -1.069721 -0.784943
H  3.989511 0.346524 -1.372052
H  1.317942 -1.450936 0.824383
H  2.968698 -1.711871 -2.366559
H  2.835377 -2.462034 -0.731221
H  4.245771 1.161201 2.316225
H  5.584832 0.52036 1.311182
H  4.519426 1.81531 0.673373
H  -0.950752 -1.07576 -1.324413
H  0.418082 1.461104 1.917959
H  -1.888763 2.454857 2.120346
H  -3.736011 1.658226 0.577786
