program: Gaussian 09
title: 000241668
version: EM64L-G09RevD.01
frameworkgroup: C1[X(C20H22N4O6S2)]
method: RPBEPBE
basis: SDD
operation: Freq
keyword: #p
keyword: freq=noraman
keyword: PBEPBE/SDD
title: #p freq=noraman PBEPBE/SDD
converged: YES YES NO NO
title: Mulliken charges:
elementType: S S O O O O O O N N N N C C C C C C C C C C C C C C C C C C C C H H H H H H H H H H H H H H H H H H H H H H
charge: 0.166674 0.166679 -0.297959 -0.297957 -0.258526 -0.258524 -0.242552 -0.242548 -0.436617 -0.436612 -0.578424 -0.578423 0.404401 0.404400 -0.524189 -0.524187 -0.426437 -0.426438 0.300357 0.300361 0.133048 0.133047 -0.345906 -0.345907 0.259084 0.259068 -0.821922 -0.821914 -0.529402 -0.529402 0.018664 0.018661 0.245318 0.245318 0.241370 0.241369 0.308037 0.308037 0.406529 0.406533 0.302643 0.299398 0.302633 0.299397 0.249663 0.216646 0.224367 0.249663 0.216647 0.224365 0.341927 0.343804 0.341928 0.343805
chargesum: 0.00000
title: Mulliken charges with hydrogens summed into heavy atoms:
elementType: S S O O O O O O N N N N C C C C C C C C C C C C C C C C C C C C
charge: 0.166674 0.166679 -0.297959 -0.297957 -0.258526 -0.258524 -0.242552 -0.242548 -0.030087 -0.030079 0.107308 0.107309 0.404401 0.404400 -0.278871 -0.278868 -0.185068 -0.185069 0.300357 0.300361 0.133048 0.133047 -0.037869 -0.037870 0.259084 0.259068 -0.219881 -0.219883 0.161274 0.161274 0.018664 0.018661
polarizability: 5.75202487e+02 -1.21677009e-03 3.31963391e+02 1.26561166e+01 1.94645138e-03 1.81171184e+02
1716.lowfreq: -0.0001 0.0005 0.0016 2.5367 2.6152 9.3213 15.2319 17.4723 22.3748
frequency: 15.2155 17.4717 22.3712 28.9771 34.1099 44.3199 45.5673 56.1604 60.9409 76.5054 76.7430 81.7558 86.1638 100.2668 108.5120 112.0510 117.3584 136.7365 147.4178 177.0881 179.2221 198.2807 203.6474 208.4378 208.8976 238.5251 251.2975 259.1951 274.6827 281.9679 314.7854 333.9192 338.0920 362.9604 387.2181 403.0590 414.5998 420.3797 442.5652 443.2200 460.6752 462.7643 464.7461 464.9778 491.7602 495.1071 499.6334 514.0862 533.5267 533.6226 562.4880 570.3702 586.3329 608.8162 610.8895 611.5652 638.9781 640.5014 644.7259 658.0046 684.4404 694.6373 740.2717 741.2469 745.2081 747.2471 778.8049 809.1506 824.8894 838.9663 846.8197 849.1476 863.3473 870.2441 871.4223 893.2303 903.6110 907.2830 938.8112 940.8045 978.0854 978.7849 998.6327 1013.2284 1052.5854 1059.7368 1059.8198 1117.1521 1117.2471 1125.4339 1126.3730 1145.9449 1147.8076 1156.4367 1156.5216 1182.2253 1201.6263 1238.7277 1240.4941 1248.6211 1249.5491 1252.0698 1255.9534 1270.9580 1271.4698 1301.8819 1302.0912 1321.7149 1349.2544 1384.1118 1415.9178 1416.2508 1417.8202 1423.9114 1443.6068 1448.3889 1466.4813 1466.9278 1468.4248 1470.2455 1488.2250 1496.8820 1519.0853 1533.9732 1584.5225 1592.2673 1598.1148 1598.3757 1607.6337 1609.9042 1615.8045 1621.7815 1655.0873 1655.5048 2958.5707 2959.0686 3044.9458 3044.9489 3046.0163 3046.1398 3126.5740 3126.7242 3143.9380 3143.9422 3147.1747 3152.3040 3153.7073 3157.6313 3193.6753 3194.0021 3359.9153 3360.3832 3523.6840 3523.7269 3676.1801 3676.1877
redmass: 7.1936 6.9216 6.6198 5.8396 4.7716 5.7384 8.7112 6.3485 9.2176 7.2493 5.5211 7.6842 3.7348 4.6175 4.7963 6.4975 5.3746 7.8748 5.6948 7.4341 2.9316 1.5988 3.6148 4.7337 4.0486 5.4501 1.6199 3.4645 2.2731 6.5542 4.4571 3.7387 4.0508 4.3775 3.8160 3.2717 4.7848 5.1047 9.0736 9.0982 3.3429 3.2364 1.2552 1.2595 4.7878 4.1187 6.1018 5.8066 1.2394 1.2393 5.4687 6.4267 6.8907 4.4402 3.7496 4.0825 4.9694 4.4184 5.3525 3.7804 5.4755 5.9771 4.7606 4.7742 4.3247 3.7178 6.2832 3.7119 3.2877 1.5557 1.4187 1.4476 1.7793 1.2039 1.1638 2.9624 2.1689 2.7026 6.6160 6.5884 1.3202 1.3339 8.8745 4.8083 2.0746 2.0485 2.0472 1.2574 1.2572 2.4276 1.9862 1.2517 1.2701 1.3513 1.3400 1.9421 2.4093 1.8078 1.7192 1.5171 1.5177 1.5274 1.5656 2.8689 2.8979 1.4673 1.9146 5.1909 3.9743 6.6917 1.2524 1.1299 1.9153 2.3275 1.5325 1.7921 1.0945 1.0509 1.1869 1.1396 1.8048 1.9679 2.4681 3.5113 3.6758 3.8404 1.8710 1.5949 4.6146 3.2267 4.4056 5.8997 4.2919 4.3174 1.0330 1.0330 1.0603 1.0603 1.1039 1.1038 1.0994 1.0994 1.1048 1.1048 1.0904 1.0894 1.0902 1.0897 1.0946 1.0948 1.0797 1.0797 1.0447 1.0447 1.1051 1.1051
irintensity: 0.5445 0.2814 0.0056 0.3438 0.5190 9.2329 0.1367 0.2087 3.0935 15.4888 0.0001 2.3055 8.4821 0.3735 0.3164 17.4444 10.1285 2.4130 16.4621 1.8554 3.6910 0.3936 1.7209 7.3499 0.1385 0.6160 2.8732 7.7185 1.0317 9.5505 6.4225 0.4012 2.2425 1.7703 9.3539 0.5203 2.2749 0.0616 0.0662 2.1321 7.1667 0.5427 3.5680 0.1268 0.9305 42.6469 4.3998 1.4371 575.8928 10.0646 12.0317 1.7314 6.1718 7.4382 98.1006 9.0711 5.5181 99.8858 6.3519 0.7364 43.7914 1.3080 0.2869 4.3544 2.9000 1.0009 41.9027 0.1338 9.0504 91.3301 10.9467 0.7029 5.8154 15.7738 249.3222 0.0112 1.8653 0.0486 6.2631 0.3415 10.6500 0.0447 8.4010 75.9144 4.4919 12.6734 2.2787 0.4718 0.0552 84.7357 16.5066 74.1316 23.9909 10.8060 1.0998 63.0357 31.1223 10.0463 52.1868 31.6483 2.0272 1.2860 22.5947 49.9702 412.4431 1.6044 128.7589 74.8549 58.6018 35.9586 84.2967 8.3263 31.0082 28.2351 29.9636 26.9394 4.5178 6.0843 51.1619 128.1804 11.1097 98.3629 1547.9179 2.2700 1.6093 187.6019 108.1064 22.7144 279.8609 26.6171 183.2128 24.4842 659.1921 1.6374 19.4152 92.9271 10.8204 1.3276 4.9406 86.2587 28.6022 14.2583 0.5737 0.0039 6.9350 14.7209 8.6315 5.3336 6.8991 0.7501 218.7636 199.2083 79.9969 75.5642 44.7676 36.3090
temp: 298.150 k
press: 1.00000 atm
elementType: 16 16 8 8 8 8 8 8 7 7 7 7 6 6 6 6 6 6 6 6 6 6 6 6 6 6 6 6 6 6 6 6 1 1 1 1 1 1 1 1 1 1 1 1 1 1 1 1 1 1 1 1 1 1
symmnumber: 1
zpe: 1064275.4 jmol-1
zpe.correction: 0.405361 hartree
zpe.thermalcorrener: 0.438317 hartree
zpe.thermalcorrenthalpy: 0.439261 hartree
zpe.thermalcorrgfe: 0.336523 hartree
zpe.sumelectzpe: -2239.522764 hartree
zpe.sumelectthermal: -2239.489808 hartree
zpe.sumelectthermalent: -2239.488864 hartree
zpe.sumelectthermalfe: -2239.591602 hartree
dipole: -0.0007 12.2023 0.0004
dipole: 12.2023
quadrupole: -142.7955 -186.9936 -196.0389
quadrupole: -0.0028 20.8108 0.0006
quadrupole: 32.4805 -11.7176 -20.7629 -0.0028 20.8108 0.0006
hfenergy: -2239.9281246 hartree
pointgroup: C01 [X(C20H22N4O6S2)]
dipole: -0.0013368 4.800757 0.0008373 debye
polarizability: 573.3758642|0.0469893|331.9633963|29.6071504|0.0297989|182.9978017 unknown
InChI: InChI=1S/C20H22N4O6S2/c1-29-15-7-11(3-5-13(15)23-17(25)9-31-19(21)27)12-4-6-14(16(8-12)30-2)24-18(26)10-32-20(22)28/h3-8,23-24H,9-10,21-22H2,1-2H3
charge 0 multiplicity 1
54 atoms
S  8.17484 -0.313656 1.112486
S  -8.174374 -0.31687 -1.112852
O  3.640355 1.570786 -0.903109
O  -3.640928 1.568893 0.903538
O  5.677482 -2.810249 0.163557
O  -5.676125 -2.812703 -0.164509
O  6.912679 1.712947 -0.288497
O  -6.913147 1.709846 0.288811
N  5.015469 -0.605731 -0.350807
N  -5.015075 -0.608078 0.350624
N  8.166303 2.358739 1.568454
N  -8.167301 2.355708 -1.567758
C  0.742917 -0.700632 -0.048091
C  -0.742487 -0.700977 0.04781
C  1.449388 0.476437 -0.42998
C  -1.449481 0.475663 0.430055
C  1.499197 -1.86714 0.235531
C  -1.498248 -1.86774 -0.236145
C  3.607896 -0.708183 -0.22749
C  -3.607459 -0.709867 0.227253
C  2.851469 0.470898 -0.519489
C  -2.851557 0.469469 0.519584
C  2.906713 -1.879007 0.149148
C  -2.905758 -1.880265 -0.149741
C  5.949506 -1.612866 -0.159728
C  -5.948669 -1.615568 0.15926
C  7.397228 -1.170851 -0.393378
C  -7.396601 -1.174207 0.392851
C  2.970422 2.829538 -1.216726
C  -2.971556 2.827875 1.217431
C  7.65394 1.432417 0.692375
C  -7.654374 1.429314 -0.692085
H  0.888293 1.376153 -0.699753
H  -0.888784 1.375547 0.70009
H  0.985147 -2.776367 0.563211
H  -0.983795 -2.776638 -0.564104
H  3.478004 -2.780669 0.375624
H  -3.476647 -2.782118 -0.376472
H  5.376589 0.335216 -0.581803
H  -5.376607 0.332644 0.581897
H  7.495474 -0.462517 -1.232677
H  8.017363 -2.0634 -0.556855
H  -7.495243 -0.466176 1.232359
H  -8.016395 -2.067058 0.555969
H  3.779589 3.530068 -1.469347
H  2.403012 3.208868 -0.344283
H  2.288863 2.715718 -2.082076
H  -3.781034 3.527981 1.470229
H  -2.404334 3.207656 0.345063
H  -2.289929 2.714163 2.082742
H  8.780553 2.094067 2.336932
H  7.915428 3.338482 1.439729
H  -8.781475 2.091011 -2.336289
H  -7.916937 3.335533 -1.438668
