program: Gaussian 09
title: 000241275
version: EM64L-G09RevD.01
frameworkgroup: C1[X(C11H13NO4)]
method: RPBEPBE
basis: SDD
operation: Freq
keyword: #p
keyword: freq=noraman
keyword: PBEPBE/SDD
title: #p freq=noraman PBEPBE/SDD
converged: YES YES NO NO
title: Mulliken charges:
elementType: O O O O N C C C C C C C C C C C H H H H H H H H H H H H H
charge: -0.273822 -0.290558 -0.209125 -0.202558 0.019500 -0.018715 -0.007490 -0.128690 -0.718299 -0.700090 0.396873 -0.507639 -0.369080 0.394126 -0.181970 -0.371865 0.215100 0.213636 0.251336 0.230074 0.238598 0.216005 0.243748 0.212995 0.227058 0.323238 0.268516 0.240430 0.288671
chargesum: 0.00000
title: Mulliken charges with hydrogens summed into heavy atoms:
elementType: O O O O N C C C C C C C C C C C
charge: -0.273822 -0.290558 -0.209125 -0.202558 0.019500 0.196385 0.206146 0.122646 -0.033623 -0.016289 0.396873 -0.184401 -0.100564 0.394126 0.058460 -0.083195
polarizability: 1.78376244e+02 -4.21611523e+00 1.48867435e+02 -1.12301312e+01 -7.19043550e+00 9.04475591e+01
1716.lowfreq: -15.5063 -8.8905 -0.0006 -0.0003 0.0003 0.3301 15.1127 19.2680 51.4741
frequency: 12.2310 18.9989 51.4719 71.0571 127.3474 151.6116 179.6754 206.5103 215.7282 220.2799 259.8352 283.4719 314.7883 346.3558 379.9615 424.0018 460.7285 468.9158 507.2050 530.8890 562.0960 611.5179 656.0238 679.1559 702.7488 728.6334 774.6469 788.8948 808.5691 823.2023 850.1692 882.2143 906.9841 952.2736 968.2941 976.7610 988.8475 1002.8177 1013.0090 1053.1877 1069.8239 1080.5653 1087.0797 1119.7998 1142.2129 1173.0610 1174.0044 1197.6603 1221.1468 1238.8606 1271.2433 1282.7679 1292.8792 1306.2343 1324.1867 1369.2479 1370.9770 1392.3210 1395.9525 1397.6438 1427.9365 1461.5548 1462.8392 1472.3568 1476.6257 1480.3045 1589.1385 1614.7678 2959.8778 2986.9437 2990.8443 2995.3733 3014.6780 3086.5590 3092.1150 3101.4150 3103.0881 3145.9083 3164.8158 3186.1155 3187.9563
redmass: 4.7423 4.0501 10.2951 3.7952 6.6811 4.9572 4.2364 1.1391 1.7559 1.4037 4.2281 4.6801 2.9081 3.5937 6.5842 3.2413 5.5573 4.9484 3.4700 5.1596 5.4197 6.5644 7.3705 5.4844 2.7110 9.2963 4.9538 2.4115 2.9530 1.7688 2.2574 3.4426 6.4760 1.6196 1.4736 1.2441 5.9604 1.3766 3.3165 2.7141 1.7117 1.6836 1.7128 2.7302 2.1927 2.0131 1.1371 3.3611 4.1229 1.3506 1.3012 1.3254 1.1690 1.2701 1.3746 1.7119 10.2426 1.2440 1.2463 7.4087 2.9620 1.0442 1.0609 2.7387 1.0494 1.0473 6.9691 6.9940 1.0836 1.0853 1.0377 1.0365 1.0866 1.0989 1.0990 1.1002 1.1003 1.0877 1.0946 1.0945 1.0940
irintensity: 1.4366 3.3572 0.2744 0.3190 0.3840 3.1251 2.6937 0.3425 1.0274 0.4022 1.7855 1.4631 0.4910 6.7146 1.0626 1.0083 0.7013 4.9828 5.6014 4.2090 8.5058 9.3874 13.2159 4.4770 44.8664 17.0190 17.1246 5.7127 1.9553 41.0686 10.1589 11.4328 55.6284 9.7438 29.1089 14.4384 1.6898 5.3460 68.5239 150.6118 13.4071 43.6438 10.6142 7.1294 0.9762 1.0882 17.4552 112.8965 180.2697 15.4779 3.3833 0.4398 33.5325 12.8391 1.4165 0.1449 114.1265 23.7619 23.1196 3.1058 19.0117 18.4079 0.3606 23.5340 10.5245 12.3773 5.9817 1.1749 15.4255 65.7537 15.3974 24.1168 31.6643 30.8984 21.5224 6.7148 41.0921 4.7258 7.1594 1.1342 9.9375
temp: 298.150 k
press: 1.00000 atm
elementType: 8 8 8 8 7 6 6 6 6 6 6 6 6 6 6 6 1 1 1 1 1 1 1 1 1 1 1 1 1
symmnumber: 1
zpe: 591373.9 jmol-1
zpe.correction: 0.225242 hartree
zpe.thermalcorrener: 0.240178 hartree
zpe.thermalcorrenthalpy: 0.241122 hartree
zpe.thermalcorrgfe: 0.180551 hartree
zpe.sumelectzpe: -781.326710 hartree
zpe.sumelectthermal: -781.311774 hartree
zpe.sumelectthermalent: -781.310830 hartree
zpe.sumelectthermalfe: -781.371401 hartree
dipole: -4.9330 2.8655 -1.3545
dipole: 5.8634
quadrupole: -102.8722 -92.9471 -92.5428
quadrupole: 15.2753 4.8221 0.4737
quadrupole: -6.7515 3.1736 3.5779 15.2753 4.8221 0.4737
hfenergy: -781.5519522 hartree
pointgroup: C01 [X(C11H13N1O4)]
dipole: -1.7195913 -1.0334298 1.1386699 debye
polarizability: 178.3809251|7.8240994|138.7994423|0.4702145|-24.9118066|100.5108705 unknown
InChI: InChI=1S/C11H13NO4/c1-7-8(2)16-11(15-7)9-4-3-5-10(6-9)12(13)14/h3-8,11H,1-2H3
charge 0 multiplicity 1
29 atoms
O  -2.359397 -1.406133 0.072625
O  -1.916293 0.447596 -1.330442
O  4.325479 1.221634 -0.460144
O  2.597243 2.239417 -1.543775
N  3.093517 1.273823 -0.845798
C  -2.831384 -0.183645 0.789347
C  -2.999518 0.830476 -0.36869
C  -1.459373 -0.907185 -0.974353
C  -4.101146 -0.537163 1.554256
C  -2.830188 2.300122 0.009778
C  -0.001656 -0.875525 -0.510228
C  0.850139 0.184508 -0.885425
C  0.50547 -1.94317 0.272868
C  2.194895 0.154184 -0.459975
C  1.857082 -1.950354 0.687213
C  2.720577 -0.897526 0.321305
H  -2.02748 0.164122 1.473049
H  -3.972073 0.656447 -0.872628
H  -1.59462 -1.579114 -1.842345
H  -4.876053 -0.914006 0.8642
H  -3.896507 -1.317754 2.306256
H  -4.494601 0.351259 2.080558
H  -2.865251 2.936148 -0.890672
H  -3.644579 2.619243 0.6862
H  -1.862047 2.46751 0.513658
H  0.473793 1.019041 -1.481927
H  -0.171418 -2.751499 0.568813
H  2.237132 -2.776028 1.29737
H  3.770455 -0.872728 0.624303
