program: Gaussian 09
title: 000241277
version: EM64L-G09RevD.01
frameworkgroup: C1[X(C15H21NO4)]
method: RPBEPBE
basis: SDD
operation: Freq
keyword: #p
keyword: freq=noraman
keyword: PBEPBE/SDD
title: #p freq=noraman PBEPBE/SDD
converged: YES YES NO NO
title: Mulliken charges:
elementType: O O O O N C C C C C C C C C C C C C C C H H H H H H H H H H H H H H H H H H H H H
charge: -0.274632 -0.245997 -0.209890 -0.205702 0.018976 -0.080441 0.007880 -0.396594 -0.441149 -0.372641 -0.044176 -0.363758 -0.725284 0.400043 -0.696108 -0.512817 -0.396966 0.385528 -0.182207 -0.374455 0.197843 0.187826 0.239022 0.194512 0.225378 0.189794 0.214891 0.241355 0.196044 0.187443 0.227261 0.223179 0.223828 0.205479 0.204433 0.215887 0.221730 0.311234 0.277349 0.238925 0.286979
chargesum: 0.00000
title: Mulliken charges with hydrogens summed into heavy atoms:
elementType: O O O O N C C C C C C C C C C C C C C C
charge: -0.274632 -0.245997 -0.209890 -0.205702 0.018976 0.117402 0.195705 0.036940 -0.025976 0.083606 0.151868 0.050945 -0.072800 0.400043 -0.054058 -0.201583 -0.119617 0.385528 0.056718 -0.087476
polarizability: 2.26099274e+02 5.31784006e+00 2.06222776e+02 1.26991711e+01 4.31754266e+00 1.21633029e+02
1716.lowfreq: -5.3878 -0.0006 -0.0001 0.0004 4.1584 5.8259 16.2139 40.7248 41.5853
frequency: 15.8363 40.6666 41.5399 53.7333 64.7741 76.1336 88.9381 100.9044 134.6254 169.5541 175.6643 199.6053 227.5844 230.2464 236.2749 245.0911 273.2943 290.5938 311.1112 330.5702 380.1985 402.0563 423.3991 433.4080 477.1852 501.2065 523.5979 543.2301 601.8078 632.3235 661.4000 686.5641 702.5072 710.6212 738.0688 758.7892 777.2621 810.8590 825.6203 834.8137 871.8503 889.7817 900.3780 921.0678 931.9085 935.8932 965.0390 968.0276 975.4141 990.5902 1006.3384 1017.2312 1033.3007 1043.9775 1062.6380 1084.5295 1086.8073 1088.6576 1101.4088 1111.8041 1154.5216 1155.8069 1173.8869 1204.5260 1217.9238 1224.5160 1230.1588 1238.0458 1259.2770 1276.2309 1281.5325 1287.9325 1300.7101 1310.4687 1332.9662 1336.4001 1347.1407 1353.8547 1368.0230 1369.9163 1374.6570 1391.7569 1392.8015 1400.8318 1431.1325 1450.9356 1463.2121 1468.4748 1473.4544 1478.5485 1479.3244 1481.9812 1485.3750 1494.2547 1591.8454 1621.5568 2847.6124 2893.8704 2936.4874 2966.9809 2970.1101 2973.6005 2974.4608 2975.9862 2996.5281 3025.5365 3047.7406 3048.9213 3071.3895 3071.7371 3075.9481 3078.4188 3100.0717 3150.8049 3176.6945 3187.2806 3193.3684
redmass: 5.3922 4.3791 4.0571 4.5212 1.9578 2.6257 3.5069 3.2706 2.8792 4.7653 4.4125 3.5919 1.5764 2.6974 1.4784 3.0702 2.7231 3.9809 3.0315 3.4442 5.3133 2.4057 3.3047 5.0663 4.8067 3.6917 5.5475 4.0473 4.1482 6.1592 6.4270 3.1928 3.4073 2.6998 1.2352 2.5597 3.8935 1.7490 1.9623 1.7624 2.6715 2.0664 1.7948 2.2905 2.4223 3.2296 1.5224 1.9004 2.2291 5.9789 1.3597 2.8224 1.8932 2.2952 2.5448 1.8992 1.7600 1.7642 2.1225 1.8414 2.0694 2.3336 1.1329 2.6594 1.1716 4.0311 1.3216 1.2897 1.4070 1.2710 1.2980 1.1575 1.1838 1.3050 1.2837 1.4563 1.5548 1.4026 1.6754 2.9795 2.2574 1.2226 1.2190 7.0324 2.9282 1.0796 1.0808 1.0668 1.0574 1.0592 1.0433 3.0420 1.0758 1.0542 7.0835 7.0616 1.0802 1.0823 1.0702 1.0804 1.0607 1.0409 1.0379 1.0616 1.0615 1.0937 1.0992 1.1002 1.0992 1.1003 1.0993 1.1005 1.0933 1.0884 1.0931 1.0969 1.0926
irintensity: 1.0823 0.1491 0.4548 0.0465 0.2964 0.6965 0.2219 1.0094 1.0167 2.4757 2.6815 0.5265 0.9188 1.9796 1.0293 0.6151 1.2145 2.4252 0.9433 0.6910 1.6147 2.9216 0.5938 1.5801 0.5344 6.4873 1.1600 1.8244 6.9007 1.4935 12.8998 12.6954 34.4426 8.6874 2.8674 9.9738 22.4492 35.2939 17.8738 10.3215 7.3259 17.5605 0.6789 13.0015 26.0138 92.0584 10.0096 5.6194 27.9223 1.4020 0.9244 108.7079 12.6413 4.9758 1.9703 78.1457 17.3254 5.9361 12.9903 27.5968 3.8704 33.0490 22.8523 86.8442 6.5944 198.0388 0.3411 6.5846 2.6225 4.1344 4.2463 4.1266 14.9512 11.2768 30.1413 11.4768 4.1116 5.7739 21.3625 62.0442 65.9464 10.9149 15.8638 2.4730 17.3069 3.7322 13.5935 3.7788 3.6510 15.8743 11.6597 22.6783 12.2323 8.8851 8.1308 2.0294 56.9362 47.9367 57.8300 43.7070 36.8458 32.3114 40.0308 49.0313 19.6055 4.4852 3.9249 10.4793 10.5859 117.4273 46.4651 59.4114 28.6588 9.0792 1.8548 2.8794 7.0797
temp: 298.150 k
press: 1.00000 atm
elementType: 8 8 8 8 7 6 6 6 6 6 6 6 6 6 6 6 6 6 6 6 1 1 1 1 1 1 1 1 1 1 1 1 1 1 1 1 1 1 1 1 1
symmnumber: 1
zpe: 887544.4 jmol-1
zpe.correction: 0.338048 hartree
zpe.thermalcorrener: 0.357998 hartree
zpe.thermalcorrenthalpy: 0.358942 hartree
zpe.thermalcorrgfe: 0.287550 hartree
zpe.sumelectzpe: -938.217472 hartree
zpe.sumelectthermal: -938.197522 hartree
zpe.sumelectthermalent: -938.196578 hartree
zpe.sumelectthermalfe: -938.267970 hartree
dipole: -5.5502 -3.4301 -2.2311
dipole: 6.8955
quadrupole: -126.9018 -120.8741 -117.7759
quadrupole: -15.9104 -0.8078 -0.5701
quadrupole: -5.0512 0.9765 4.0747 -15.9104 -0.8078 -0.5701
hfenergy: -938.5555203 hartree
pointgroup: C01 [X(C15H21N1O4)]
dipole: 1.8828177 1.2927672 -1.4641099 debye
polarizability: 222.7825406|12.9104064|179.8954621|0.2847755|-42.7023244|151.2770761 unknown
InChI: InChI=1S/C15H21NO4/c1-3-6-14-11(4-2)10-19-15(20-14)12-7-5-8-13(9-12)16(17)18/h5,7-9,11,14-15H,3-4,6,10H2,1-2H3
charge 0 multiplicity 1
41 atoms
O  1.097091 -0.383385 -0.034647
O  0.683595 1.389795 -1.631402
O  -4.761866 -2.415215 1.110741
O  -2.624688 -3.097161 1.514259
N  -3.484115 -2.319837 0.944736
C  2.954965 1.159653 -0.623904
C  2.575206 -0.301568 -0.242304
C  2.137087 1.528818 -1.885846
C  3.229147 -0.85905 1.02661
C  2.755302 2.16389 0.540454
C  0.386713 0.012664 -1.24371
C  3.049035 -2.385963 1.183497
C  3.178596 3.60974 0.200972
C  -1.103653 -0.116319 -0.996962
C  3.670445 -2.922294 2.490127
C  -1.584009 -1.127872 -0.138913
C  -2.016197 0.748703 -1.648627
C  -2.976242 -1.25444 0.042918
C  -3.40807 0.602435 -1.446849
C  -3.90575 -0.406141 -0.597697
H  4.028485 1.161298 -0.914424
H  2.825984 -0.960236 -1.109882
H  2.277466 2.576349 -2.1909
H  2.419682 0.864308 -2.733478
H  2.795858 -0.347772 1.906978
H  4.309958 -0.608777 1.005516
H  3.349186 1.818922 1.408116
H  1.694936 2.145045 0.852716
H  0.726228 -0.655427 -2.077539
H  3.50736 -2.901284 0.31409
H  1.968326 -2.622265 1.158214
H  2.520549 4.067886 -0.559239
H  3.12937 4.249866 1.100514
H  4.217717 3.647435 -0.179847
H  4.756955 -2.715809 2.5322
H  3.20348 -2.447731 3.373508
H  3.53017 -4.014512 2.582641
H  -0.896085 -1.790808 0.390115
H  -1.62332 1.539015 -2.294297
H  -4.105257 1.27871 -1.951705
H  -4.975443 -0.545666 -0.422051
