program: Gaussian 09
title: 000241287
version: EM64L-G09RevD.01
frameworkgroup: C1[X(C15H29ClO2)]
method: RPBEPBE
basis: SDD
operation: Freq
keyword: #p
keyword: freq=noraman
keyword: PBEPBE/SDD
title: #p freq=noraman PBEPBE/SDD
converged: YES YES NO NO
title: Mulliken charges:
elementType: Cl O O C C C C C C C C C C C C C C C H H H H H H H H H H H H H H H H H H H H H H H H H H H H H
charge: -0.046843 -0.254643 -0.264900 -0.379797 -0.381598 -0.407807 -0.387562 0.009926 -0.384899 -0.385017 -0.381689 0.032859 -0.309977 -0.373006 -0.353143 -0.654215 -0.356832 -0.696685 0.185478 0.227790 0.192108 0.199377 0.216379 0.223491 0.193119 0.197639 0.196266 0.194629 0.193233 0.193886 0.192524 0.192247 0.191599 0.242839 0.215430 0.213410 0.188978 0.189664 0.187805 0.187395 0.259098 0.277900 0.194844 0.194548 0.209666 0.209660 0.214827
chargesum: 0.00000
title: Mulliken charges with hydrogens summed into heavy atoms:
elementType: Cl O O C C C C C C C C C C C C C C C
charge: -0.046843 -0.254643 -0.264900 0.033471 0.009887 0.032063 0.003197 0.206192 0.002962 0.001392 0.002157 0.275698 0.118863 0.005635 0.022057 -0.117216 0.032560 -0.062531
polarizability: 2.41702956e+02 4.19885437e+00 1.57182378e+02 1.20856547e-01 2.95011033e+00 1.40850775e+02
1716.lowfreq: -0.0026 -0.0023 -0.0018 2.9233 5.1906 9.3222 16.7864 19.6705 24.5757
frequency: 15.8297 19.2718 24.3531 35.1939 38.8175 53.4536 62.1833 72.5556 77.7856 97.7487 107.8336 116.8571 130.7593 142.5397 150.0926 154.0385 164.2946 182.5440 223.6039 233.7494 281.1935 298.9862 323.5566 375.4656 402.5503 443.0257 465.8285 498.0555 520.7537 638.0236 666.9276 686.1981 719.8517 721.8205 726.3292 735.6692 754.5337 783.3190 812.7771 824.8438 873.2525 888.2075 889.0178 925.4735 935.4041 972.4992 980.6273 985.3966 996.9753 1002.4975 1023.4819 1026.8046 1027.8921 1041.3261 1063.5796 1076.0246 1080.9723 1081.3850 1084.2719 1096.9949 1112.3888 1124.0288 1149.7960 1166.1797 1183.6402 1201.6928 1205.7401 1209.2473 1233.3843 1236.2192 1256.3815 1260.3897 1262.0331 1269.9759 1279.4988 1281.4433 1288.0841 1289.9463 1293.3765 1297.5647 1299.5443 1309.5658 1313.2786 1322.1935 1337.3323 1350.5250 1354.1574 1354.9428 1357.4784 1360.5749 1388.5241 1396.1312 1429.1974 1449.2833 1458.3815 1458.5214 1461.9744 1462.4098 1466.1925 1471.4213 1476.9849 1477.7657 1482.1906 1484.9910 1486.1849 1488.0588 2920.7590 2947.9369 2948.2572 2950.0262 2950.7444 2952.9265 2957.2205 2962.0197 2966.7270 2967.6733 2971.2698 2981.8060 2985.0966 2985.1883 2990.4361 2994.5773 2996.7995 2998.4039 3007.8710 3019.0441 3029.2916 3037.4907 3043.2494 3053.4659 3058.1675 3068.0976 3069.2560 3069.9306 3142.8034
redmass: 4.1827 4.2149 2.3704 3.5428 3.0023 3.9058 2.4928 2.4102 4.6354 2.1586 2.7803 2.7034 2.0000 3.1096 2.1849 2.2344 2.8018 3.2905 3.6117 1.1195 3.6392 5.3224 4.0659 2.9502 3.1237 3.0938 2.8849 3.0468 2.8564 4.4119 6.3443 6.3111 1.0583 1.0708 1.1411 1.2910 1.4168 1.3962 2.9463 1.3573 1.3337 1.8851 1.7472 1.5334 3.6442 3.0554 3.2798 1.7530 3.5905 4.0221 2.7752 1.4440 1.6166 3.5000 3.0646 2.5893 2.3397 2.2206 2.2555 1.9326 1.8642 2.8395 1.1516 1.9359 1.8155 1.2738 1.4013 1.4500 1.3308 1.3376 1.2294 1.1773 1.2827 1.2125 1.0168 1.1856 1.0623 1.2879 1.1130 1.1092 1.1104 1.2384 1.2730 1.2885 1.3946 1.4456 1.5535 1.6159 1.6340 1.6147 1.2178 1.6543 1.1109 1.0890 1.0736 1.0729 1.0638 1.0735 1.0796 1.0836 1.0834 1.0442 1.0897 1.0849 1.0940 1.0927 1.0845 1.0586 1.0586 1.0592 1.0591 1.0595 1.0595 1.0594 1.0617 1.0596 1.0365 1.0962 1.0831 1.0970 1.0984 1.0591 1.0727 1.0883 1.1020 1.1031 1.1031 1.1032 1.1040 1.0891 1.0761 1.1007 1.1030 1.0993 1.1101
irintensity: 0.0670 0.7588 0.8582 2.9748 0.4428 2.3425 1.8499 0.5322 0.8673 1.0047 1.3741 0.2357 0.1034 0.4849 0.1172 0.3835 1.4777 0.6528 1.4939 0.0010 0.2994 0.4386 4.8183 3.7655 2.3075 4.6908 3.0930 2.3115 4.6847 13.9781 3.0057 43.1667 18.6635 0.0537 3.6192 6.8877 6.8867 15.9378 17.0408 7.0549 11.4805 10.9394 8.5818 15.2343 28.2836 47.2168 3.3218 20.7641 3.2005 44.9490 3.5867 14.4189 2.9505 6.0534 5.4490 0.9983 1.7447 0.4271 2.3843 61.2058 2.0094 12.1975 1.6158 17.1513 1.9073 12.8781 6.5057 1.2915 0.7437 0.4933 0.4396 6.0397 0.0248 11.5193 0.1402 2.6065 0.6697 4.3955 0.2798 0.6118 0.5040 5.5588 5.0105 2.1507 1.1977 10.4469 3.4255 1.7667 1.1185 0.2694 11.1812 39.8391 9.7236 5.8099 0.0025 0.0893 0.1695 0.0004 0.4264 0.3991 1.9793 11.9313 0.8434 3.4775 5.5942 38.0911 72.0957 0.0454 0.2051 0.0820 0.1259 3.0529 0.5107 51.7396 5.0143 266.2649 37.7248 0.2607 22.3702 1.3752 0.7565 72.7887 11.4696 10.4938 1.5425 4.8100 0.8213 18.4601 233.8125 26.8383 29.0594 91.5741 76.5489 55.8623 8.7630
temp: 298.150 k
press: 1.00000 atm
elementType: 17 8 8 6 6 6 6 6 6 6 6 6 6 6 6 6 6 6 1 1 1 1 1 1 1 1 1 1 1 1 1 1 1 1 1 1 1 1 1 1 1 1 1 1 1 1 1
symmnumber: 1
zpe: 1089562.6 jmol-1
zpe.correction: 0.414992 hartree
zpe.thermalcorrener: 0.437692 hartree
zpe.thermalcorrenthalpy: 0.438637 hartree
zpe.thermalcorrgfe: 0.357421 hartree
zpe.sumelectzpe: -1197.991700 hartree
zpe.sumelectthermal: -1197.969000 hartree
zpe.sumelectthermalent: -1197.968056 hartree
zpe.sumelectthermalfe: -1198.049271 hartree
dipole: 0.3499 2.2880 0.0521
dipole: 2.3152
quadrupole: -126.4964 -124.1853 -116.7313
quadrupole: -20.1812 -3.7531 0.2763
quadrupole: -4.0254 -1.7143 5.7397 -20.1812 -3.7531 0.2763
hfenergy: -1198.4066923 hartree
pointgroup: C01 [X(C15H29Cl1O2)]
dipole: 0.1195302 -0.8977609 -0.0968976 debye
polarizability: 241.4917667|-5.9796222|156.7697308|0.2570306|4.2734343|141.4746115 unknown
InChI: InChI=1S/C15H29ClO2/c1-2-3-4-5-6-7-8-9-10-11-15-17-13-14(12-16)18-15/h14-15H,2-13H2,1H3
charge 0 multiplicity 1
47 atoms
Cl -8.321602 1.664983 0.083851
O  -5.174181 0.667118 0.126191
O  -4.179118 -1.378598 -0.427362
C  -1.453206 -0.250118 0.318897
C  -0.160555 0.506429 -0.058532
C  -2.726179 0.570669 0.013491
C  1.123811 -0.297579 0.243192
C  -3.998701 -0.15975 0.406191
C  2.419284 0.464869 -0.115118
C  3.705682 -0.337628 0.183234
C  5.000864 0.432841 -0.158955
C  -6.292595 -0.295828 0.047708
C  -5.635429 -1.566674 -0.592786
C  6.288509 -0.368759 0.137266
C  7.583364 0.407449 -0.193183
C  -7.402174 0.285306 -0.809941
C  8.871666 -0.394284 0.102022
C  10.159959 0.392885 -0.222301
H  -1.424722 -0.504023 1.399468
H  -1.50072 -1.210277 -0.230196
H  -0.125447 1.471548 0.489399
H  -0.187399 0.762617 -1.138193
H  -2.70293 1.529695 0.566705
H  -2.787379 0.808396 -1.064597
H  1.14367 -0.565768 1.320472
H  1.095792 -1.256537 -0.315062
H  -4.00199 -0.467804 1.477897
H  2.398817 0.737028 -1.191332
H  2.446927 1.42229 0.446391
H  3.68433 -1.290066 -0.386844
H  3.720746 -0.619247 1.257203
H  4.985427 0.717279 -1.232135
H  5.022182 1.383983 0.4134
H  -6.660735 -0.522581 1.069137
H  -5.840346 -1.648336 -1.676498
H  -5.963438 -2.490547 -0.081651
H  6.300109 -0.659918 1.208779
H  6.271719 -1.316285 -0.441264
H  7.573193 0.700499 -1.264173
H  7.601808 1.35405 0.386836
H  -8.169902 -0.469538 -1.039842
H  -6.994975 0.731566 -1.729204
H  8.855733 -1.337056 -0.482356
H  8.878015 -0.691923 1.170693
H  10.191761 0.677325 -1.291206
H  10.215165 1.323849 0.373149
H  11.065889 -0.202253 -0.003938
