program: Gaussian 09
title: 000241260
version: EM64L-G09RevD.01
frameworkgroup: C1[X(C22H16O)]
method: RPBEPBE
basis: SDD
operation: Freq
keyword: #pfreq=noraman
keyword: PBEPBE/SDD
title: #p freq=noraman PBEPBE/SDD
converged: YES YES NO NO
title: Mulliken charges:
elementType: O C C C C C C C C C C C C C C C C C C C C C C H H H H H H H H H H H H H H H H
charge: -0.278266 -0.316023 0.237271 0.237270 0.115828 0.115828 0.202706 0.202705 -0.713641 0.421468 0.421469 -0.396551 -0.396550 -0.465445 -0.465446 -0.399963 -0.399964 -0.443013 -0.443013 -0.271902 -0.271902 -0.248665 -0.248664 0.220765 0.233667 0.236956 0.236956 0.259125 0.259125 0.243450 0.243451 0.238016 0.238016 0.241426 0.241426 0.226751 0.226751 0.229292 0.229291
chargesum: 0.00000
title: Mulliken charges with hydrogens summed into heavy atoms:
elementType: O C C C C C C C C C C C C C C C C C C C C C C
charge: -0.278266 -0.095257 0.237271 0.237270 0.115828 0.115828 0.202706 0.202705 -0.006062 0.421468 0.421469 -0.137426 -0.137426 -0.221995 -0.221995 -0.161947 -0.161947 -0.201587 -0.201587 -0.045151 -0.045151 -0.019373 -0.019373
polarizability: 3.71030568e+02 -5.73054120e-06 2.77395632e+02 -1.69666208e-06 4.76391855e-01 1.07576200e+02
1716.lowfreq: -0.0004 0.0004 0.0006 5.0682 5.0959 10.6634 40.6263 59.7521 101.7279
frequency: 40.6187 59.7464 101.7278 112.1369 126.7863 150.5565 181.2502 193.7658 201.2370 230.1710 262.6885 281.1053 298.6525 340.5152 389.3455 400.9011 422.9537 428.9484 441.9763 498.9594 514.2751 522.0824 525.1149 529.9193 554.8651 558.2016 576.4901 594.9120 627.3277 658.8747 666.3338 686.0229 704.2845 745.0516 756.6688 757.8124 759.7170 790.7603 791.2299 824.3730 825.9197 826.9718 859.2652 878.6772 879.9249 931.2237 942.8680 947.4946 953.1074 954.3559 971.2318 972.0064 990.0996 990.3695 1014.9575 1032.7402 1035.2970 1055.1595 1063.7880 1099.5357 1149.9318 1150.4191 1168.4453 1173.7492 1181.3052 1200.8545 1222.2661 1228.3997 1239.5526 1241.6192 1260.1798 1272.2343 1280.4997 1295.8146 1357.5460 1377.2327 1384.8323 1405.9430 1407.2116 1425.2412 1428.0533 1433.5206 1438.5821 1452.0543 1463.6665 1469.3389 1476.9546 1518.7261 1524.6641 1586.4813 1596.7324 1603.9186 1608.6664 1628.8844 1635.8214 2985.5307 2987.0216 3088.1260 3088.6657 3121.1502 3121.1943 3130.6616 3130.7633 3135.0381 3135.1425 3147.8795 3148.1886 3163.5684 3163.7388 3169.7036 3170.1447
redmass: 4.7210 4.5662 4.4496 3.9934 3.6115 6.4374 3.8313 3.1138 1.1159 3.6547 4.1727 5.6163 5.6125 4.3357 4.4919 4.4842 3.1200 5.6406 3.0670 5.5479 6.4009 6.0110 3.5832 4.2668 5.7998 3.8373 3.3415 5.1272 4.8802 6.3522 3.8702 3.7422 4.5946 3.6779 4.2120 1.4562 1.3562 3.1216 3.1641 1.4167 3.4619 1.5649 3.7130 1.7004 1.6810 3.0401 4.4286 4.3609 1.3727 1.4173 1.3910 1.3874 1.3414 1.3378 2.0079 2.2122 2.2429 2.9650 2.2891 1.7401 1.2704 1.2887 1.4861 1.1285 1.2376 1.7961 2.0720 1.7067 3.2480 3.5759 1.6979 1.3147 1.7574 1.6760 2.6515 2.4768 1.2302 3.7286 3.6758 5.4555 3.3555 3.2566 2.9776 2.5719 2.5015 1.0588 1.0851 3.8103 4.2681 8.3983 6.1180 8.1673 6.3708 6.4769 7.2879 1.0638 1.0520 1.1005 1.1007 1.0863 1.0863 1.0880 1.0880 1.0888 1.0888 1.0940 1.0940 1.1003 1.1003 1.0963 1.0965
irintensity: 0.2513 0.0085 0.4156 0.0340 1.2864 0.3457 2.1865 0.0463 0.0022 0.0904 0.2617 6.8045 1.3644 0.2762 0.2766 1.3221 0.0307 1.1651 18.8729 5.5855 1.3081 0.8576 0.0148 0.1129 0.3215 0.9461 8.3737 3.7000 0.2259 3.4566 0.0515 5.7599 7.1342 6.2845 3.3977 0.3554 69.5615 13.3286 0.4253 2.4212 15.1258 138.6948 1.2262 0.4958 14.4257 6.7812 70.3312 1.4118 3.3246 2.7498 0.9052 3.7835 0.1341 0.3780 2.0633 5.3209 5.0383 6.1109 6.3108 17.5372 2.8033 1.4544 3.8768 35.8457 2.8299 31.6344 337.3847 0.8244 13.5455 168.9426 1.7831 3.2606 1.6606 1.3035 0.6322 12.8253 16.8845 20.0643 1.0396 5.1797 37.2749 56.8912 1.2421 75.3050 2.3079 8.4945 2.8724 33.6429 17.9334 20.5580 67.1906 0.4575 0.4275 36.7594 13.1200 12.0793 23.4548 39.0846 15.1545 6.7943 1.8145 0.0162 6.9528 11.4193 10.0649 59.3736 11.5362 23.5670 40.9356 4.4810 11.6886
temp: 298.150 k
press: 1.00000 atm
elementType: 8 6 6 6 6 6 6 6 6 6 6 6 6 6 6 6 6 6 6 6 6 6 6 1 1 1 1 1 1 1 1 1 1 1 1 1 1 1 1
symmnumber: 1
zpe: 811721.3 jmol-1
zpe.correction: 0.309168 hartree
zpe.thermalcorrener: 0.326078 hartree
zpe.thermalcorrenthalpy: 0.327022 hartree
zpe.thermalcorrgfe: 0.265334 hartree
zpe.sumelectzpe: -921.648436 hartree
zpe.sumelectthermal: -921.631526 hartree
zpe.sumelectthermalent: -921.630582 hartree
zpe.sumelectthermalfe: -921.692270 hartree
dipole: 0.0000 -1.0434 0.0332
dipole: 1.0439
quadrupole: -113.8531 -119.3849 -141.3030
quadrupole: 0.0000 0.0000 -1.2741
quadrupole: 10.9939 5.4621 -16.4560 0.0000 0.0000 -1.2741
hfenergy: -921.9576039 hartree
pointgroup: C01 [X(C22H16O1)]
dipole: 0.0000012 -0.4100142 -0.0236438 debye
polarizability: 371.0305682|0.0004802|277.3071714|0.0004976|3.9040244|107.66466 unknown
InChI: InChI=1S/C22H16O/c1-14-21-17-8-4-2-6-15(17)10-12-19(21)23-20-13-11-16-7-3-5-9-18(16)22(14)20/h2-14H,1H3
charge 0 multiplicity 1
39 atoms
O  -0.000013 2.318111 -0.220415
C  0.000003 -0.596345 -0.486702
C  1.261589 0.199488 -0.154447
C  -1.261593 0.199475 -0.154452
C  1.210168 1.596213 -0.093483
C  -1.210187 1.5962 -0.093488
C  2.543834 -0.438805 0.03033
C  -2.543833 -0.438831 0.03032
C  0.000008 -1.002191 -1.998372
C  3.727353 0.374676 0.244894
C  -3.727361 0.374638 0.24488
C  2.363579 2.410726 0.106727
C  -2.363607 2.410701 0.106718
C  3.603935 1.804385 0.267964
C  -3.603957 1.804348 0.267951
C  2.706422 -1.866096 0.006904
C  -2.706405 -1.866124 0.006893
C  4.998417 -0.259219 0.429354
C  -4.998419 -0.25927 0.429334
C  3.959186 -2.45692 0.194326
C  -3.959164 -2.456961 0.19431
C  5.119653 -1.650279 0.406399
C  -5.11964 -1.650332 0.406378
H  0.000006 -1.524601 0.116763
H  0.000004 -0.098893 -2.633608
H  0.897699 -1.595295 -2.24737
H  -0.897675 -1.595305 -2.247373
H  2.236344 3.496664 0.134984
H  -2.236383 3.496641 0.134976
H  4.501164 2.414243 0.422451
H  -4.501193 2.414196 0.422434
H  1.835678 -2.509474 -0.154433
H  -1.835654 -2.509493 -0.15444
H  5.88074 0.371422 0.592128
H  -5.880749 0.371361 0.592105
H  4.054771 -3.548344 0.17825
H  -4.054738 -3.548386 0.178233
H  6.096061 -2.125279 0.549901
H  -6.096044 -2.125342 0.549876
