program: Gaussian 09
title: 000241245
version: EM64L-G09RevD.01
frameworkgroup: C1[X(C17H15NO)]
method: RPBEPBE
basis: SDD
operation: Freq
keyword: #p
keyword: freq=noraman
keyword: PBEPBE/SDD
title: #p freq=noraman PBEPBE/SDD
converged: YES YES NO NO
title: Mulliken charges:
elementType: O N C C C C C C C C C C C C C C C C C H H H H H H H H H H H H H H H
charge: -0.435996 -0.436403 0.161837 0.209037 -0.512898 0.428167 0.116326 -0.450373 -0.380038 -0.419227 -0.443357 0.460582 -0.264461 -0.246095 -0.361011 -0.422936 -0.229133 -0.197475 -0.276503 0.214541 0.279379 0.240260 0.276849 0.299229 0.218350 0.240286 0.229146 0.229542 0.241523 0.214465 0.361240 0.215843 0.216918 0.222384
chargesum: 0.00000
title: Mulliken charges with hydrogens summed into heavy atoms:
elementType: O N C C C C C C C C C C C C C C C C C
charge: -0.074756 -0.137174 0.161837 0.209037 -0.018978 0.428167 0.116326 -0.210112 -0.103189 -0.200877 -0.203070 0.460582 -0.035314 -0.016553 -0.119488 -0.208471 -0.013290 0.019444 -0.054119
polarizability: 2.70281522e+02 -4.23835511e+00 2.11593295e+02 -1.71361862e+01 -2.60542058e+00 1.22727624e+02
1716.lowfreq: -9.1182 -6.8641 -1.6551 -0.0007 0.0001 0.0006 20.6896 37.2425 51.1264
frequency: 20.4343 37.2240 51.1162 106.5527 109.0863 139.3804 160.4455 222.6776 230.0449 284.2605 306.5355 327.3528 338.0148 375.0785 407.2097 411.0681 428.1387 443.9833 477.4772 505.7501 517.6325 530.7774 545.7258 565.7374 614.1256 618.9611 666.2837 690.6713 698.6990 723.7091 752.3983 757.5693 782.3888 808.8636 813.2223 830.7907 863.5207 866.1819 877.6866 903.7354 941.3824 953.2375 967.7257 971.3787 976.2368 992.2095 1017.3964 1022.2230 1038.0870 1054.0208 1075.3740 1107.1254 1146.1990 1163.8257 1168.2051 1175.2826 1186.9290 1201.9074 1230.6415 1243.1776 1246.5424 1276.6876 1282.7962 1327.6808 1354.6786 1373.2989 1385.9913 1407.4638 1426.5264 1428.7941 1438.6404 1471.7011 1477.3724 1496.7852 1508.5624 1516.9623 1586.3714 1591.8378 1611.6345 1624.8485 1638.1220 2939.7146 3003.4466 3107.9321 3111.3881 3121.5375 3121.8190 3134.5810 3134.7852 3143.5253 3151.6384 3154.5646 3165.1207 3168.0785 3570.2990 3588.8070
redmass: 5.3175 3.7759 4.4478 4.9243 5.5809 4.4867 4.9003 4.2143 4.1562 3.1144 4.7771 1.1378 3.3245 1.2074 3.5086 3.0158 7.0052 3.1053 4.5466 2.6967 4.8405 3.4624 4.0289 4.7219 6.3665 5.4168 3.7254 1.8468 5.7749 5.2729 1.8044 1.3195 3.3147 1.4724 1.3064 4.0557 3.7550 1.6438 1.6067 3.2361 1.3372 1.3632 1.4089 1.2931 5.7705 1.3333 2.1954 2.2727 2.0110 3.4185 2.1518 2.5645 1.4498 1.1766 1.0478 1.1302 1.1094 1.3731 1.5665 1.5649 2.6516 1.5862 1.7572 1.5507 1.8395 2.1344 3.1551 3.0988 3.5354 2.3924 3.4436 2.8148 1.8085 1.5038 1.7427 3.3599 5.3700 7.2638 5.7496 6.2310 6.7679 1.0649 1.0950 1.0867 1.0875 1.0867 1.0860 1.0931 1.0892 1.0966 1.0935 1.0948 1.1006 1.0990 1.0773 1.0662
irintensity: 0.0386 0.2139 0.3685 3.2277 0.4290 0.3767 0.8569 9.5037 1.4232 2.5045 3.5316 112.6490 23.6588 112.7228 1.5161 0.6549 3.4042 18.1508 2.4428 14.8444 1.1196 0.5807 4.2975 4.0190 0.5657 2.8512 4.0394 38.9555 8.0627 3.5563 83.2800 24.1352 14.6249 81.7337 7.3673 8.2259 6.4343 9.7214 4.8326 27.1600 0.8213 0.1667 4.6460 1.1111 5.6515 0.1743 54.4471 6.2206 32.9088 11.3309 14.7575 21.8775 49.5449 28.6497 1.3707 0.2949 14.5058 26.7613 6.6275 6.8963 143.7027 18.6491 6.0732 50.1313 17.6439 4.0632 60.1207 12.1743 14.0325 22.7366 5.9171 8.3466 2.2466 244.7847 64.5043 39.0054 8.4847 12.2094 6.2445 255.0927 41.3672 39.8815 11.5350 15.2048 11.2711 2.9239 4.6051 32.7103 10.4370 23.7135 46.2492 27.3186 14.3505 19.2780 34.9229 50.1662
temp: 298.150 k
press: 1.00000 atm
elementType: 8 7 6 6 6 6 6 6 6 6 6 6 6 6 6 6 6 6 6 1 1 1 1 1 1 1 1 1 1 1 1 1 1 1
symmnumber: 1
zpe: 714969.8 jmol-1
zpe.correction: 0.272318 hartree
zpe.thermalcorrener: 0.288061 hartree
zpe.thermalcorrenthalpy: 0.289005 hartree
zpe.thermalcorrgfe: 0.228053 hartree
zpe.sumelectzpe: -785.470818 hartree
zpe.sumelectthermal: -785.455075 hartree
zpe.sumelectthermalent: -785.454131 hartree
zpe.sumelectthermalfe: -785.515083 hartree
dipole: -3.7920 1.3535 0.7705
dipole: 4.0993
quadrupole: -104.5214 -98.4372 -109.8954
quadrupole: -7.2584 -4.2643 0.0860
quadrupole: -0.2368 5.8475 -5.6107 -7.2584 -4.2643 0.0860
hfenergy: -785.7431359 hartree
pointgroup: C01 [X(C17H15N1O1)]
dipole: -1.4369839 -0.6866545 -0.2543586 debye
polarizability: 268.2797838|11.431312|210.9355137|19.6745182|-12.1943135|125.3871432 unknown
InChI: InChI=1S/C17H15NO/c19-17-11-10-13-6-4-5-9-15(13)16(17)12-18-14-7-2-1-3-8-14/h1-11,18-19H,12H2
charge 0 multiplicity 1
34 atoms
O  -0.690712 -3.323149 0.4592
N  1.28849 -0.208806 -0.316078
C  -0.972345 -0.93177 0.369289
C  -1.818654 0.215511 0.14058
C  0.481621 -0.769753 0.781083
C  -3.21029 0.028207 -0.225269
C  -1.528091 -2.21343 0.22843
C  -3.721538 -1.303693 -0.355149
C  -1.327827 1.560569 0.270204
C  -2.900755 -2.405786 -0.133153
C  -4.047184 1.171566 -0.44249
C  2.636314 0.132206 -0.184634
C  -2.168781 2.655301 0.054775
C  -3.540414 2.46495 -0.305497
C  3.319417 0.03119 1.064811
C  3.360179 0.614341 -1.318921
C  4.675351 0.411274 1.165443
C  4.712476 0.985018 -1.201484
C  5.386106 0.891121 0.042112
H  0.541123 -0.087235 1.656007
H  0.881223 -1.750024 1.105381
H  -4.772495 -1.44744 -0.631012
H  -0.276051 1.723383 0.523621
H  0.88559 -0.243643 -1.252057
H  -3.298869 -3.42424 -0.232344
H  -5.096803 1.011873 -0.717565
H  -1.775226 3.672537 0.159032
H  -4.185348 3.334357 -0.472425
H  2.799937 -0.350926 1.949065
H  2.849421 0.697869 -2.287184
H  -1.186449 -4.169505 0.334583
H  5.180999 0.325606 2.134799
H  5.245811 1.352086 -2.086481
H  6.438069 1.181933 0.129225
