program: Gaussian 09
title: 000241246
version: EM64L-G09RevD.01
frameworkgroup: C1[X(C18H14BrNO)]
method: RPBEPBE
basis: SDD
operation: Freq
keyword: #p
keyword: freq=noraman
keyword: PBEPBE/SDD
title: #p freq=noraman PBEPBE/SDD
converged: YES YES NO NO
title: Mulliken charges:
elementType: Br O N C C C C C C C C C C C C C C C C C C H H H H H H H H H H H H H H
charge: -0.002519 -0.246279 -0.178762 -0.503027 0.164282 0.207510 0.153571 -0.437063 0.430523 0.456998 -0.388226 -0.444434 -0.381434 -0.435841 -0.373546 -0.348758 -0.260129 -0.246762 -0.170293 -0.178366 -0.236314 0.244281 0.241992 0.250501 0.253334 0.253248 0.241846 0.236258 0.241327 0.238017 0.266859 0.226731 0.229581 0.247318 0.247573
chargesum: 0.00000
title: Mulliken charges with hydrogens summed into heavy atoms:
elementType: Br O N C C C C C C C C C C C C C C C C C C
charge: -0.002519 -0.246279 -0.178762 -0.016754 0.164282 0.207510 0.153571 0.066773 0.430523 0.456998 -0.134978 -0.202588 -0.145176 -0.194513 -0.135529 -0.081899 -0.033398 -0.017182 0.077025 0.069207 -0.236314
polarizability: 3.16123430e+02 -2.06071584e+01 2.20270638e+02 -3.28910547e+00 -2.66012133e+01 1.44859072e+02
1716.lowfreq: -8.9255 -4.4465 -2.4329 -0.0004 -0.0003 0.0005 11.1895 40.2612 53.3870
frequency: 11.0067 40.1048 53.3833 72.8775 113.3707 138.4457 179.6750 180.5324 213.1641 235.3637 249.4442 313.0521 325.3608 377.3095 383.1904 408.3575 410.8924 416.0910 432.5362 483.8019 506.9796 519.7940 528.1936 537.9620 565.9808 582.4038 623.5326 658.3072 661.3947 675.1657 702.9151 722.4145 756.0110 777.0316 783.7034 811.4500 822.2440 825.4686 834.2263 850.7856 874.4796 923.5302 938.4388 951.2528 952.4246 970.0806 979.9883 984.6984 989.1095 992.6092 1032.9182 1048.5275 1064.9144 1091.7584 1118.0085 1148.7702 1160.8547 1177.7514 1194.6828 1195.7203 1218.5275 1224.3399 1234.7436 1240.5278 1272.2341 1300.5697 1312.7161 1358.9261 1364.1965 1369.4209 1389.2551 1405.4009 1407.2558 1425.5026 1434.9076 1451.9250 1471.0082 1477.1213 1484.3229 1520.1276 1571.5802 1585.4877 1601.3445 1604.7224 1631.0864 2947.6048 3002.2497 3052.6710 3121.5857 3129.1442 3132.8365 3138.9370 3142.1795 3145.8267 3151.0951 3163.2656 3168.4412 3169.0533 3172.6018
redmass: 7.2858 6.0865 3.8815 6.2648 5.3925 6.5431 5.5514 4.2247 3.7000 6.9481 4.6244 4.9103 4.4186 6.2813 3.4448 3.2636 3.5108 3.9044 3.8342 3.8050 5.0168 2.9750 3.3450 3.3642 5.3361 6.6696 7.0068 4.1496 4.9423 5.8763 3.4289 5.7993 1.3073 4.1286 3.5371 1.2616 1.7587 1.4157 5.0944 4.9581 1.6364 4.3866 1.3659 1.3470 1.3699 1.4738 1.9250 4.9434 1.3540 2.9892 2.2414 3.0874 2.7092 2.0523 1.5079 1.3498 1.5871 1.1418 1.1567 2.3891 1.4863 1.5317 1.7799 1.9558 1.7106 1.2957 1.5231 2.9247 3.6306 1.4100 1.9929 3.3313 3.6191 3.6092 3.7713 1.7925 1.3372 1.1613 2.4079 3.7217 7.5527 7.8260 6.1184 6.0748 6.6776 1.0694 1.0686 1.0917 1.0860 1.0880 1.0888 1.0991 1.0886 1.0945 1.0883 1.1004 1.0959 1.0962 1.0971
irintensity: 0.0794 0.2067 0.8567 0.0697 0.8513 1.1816 0.9155 0.7388 6.5370 0.5013 2.9268 1.9103 10.2742 6.2314 4.4232 1.6487 0.5995 15.7674 5.1934 6.1618 7.1930 5.6133 17.1707 0.8236 17.3121 6.6285 1.9098 2.9214 5.5860 7.2905 1.7219 0.5774 42.3120 29.2587 34.8268 1.3984 44.4651 71.7840 222.1956 41.4464 8.2598 117.3696 9.3325 2.3393 2.2014 5.5375 9.9475 14.3125 0.7909 33.7561 4.4673 26.0484 27.6068 12.7552 8.2811 3.8469 50.4981 4.3548 5.1386 132.0173 72.4939 172.3959 1.9305 40.1579 6.1987 0.9731 18.3184 19.2378 5.3003 37.8200 35.4868 13.7010 3.8091 22.0144 17.6720 25.6161 28.3805 33.2167 281.7357 28.5702 2.0071 11.4818 67.1320 38.9046 34.1314 39.7653 62.8425 9.5579 4.0910 2.3022 9.7383 14.7907 15.6514 35.7433 5.3093 32.6616 9.0473 8.6314 0.4540
temp: 298.150 k
press: 1.00000 atm
elementType: 35 8 7 6 6 6 6 6 6 6 6 6 6 6 6 6 6 6 6 6 6 1 1 1 1 1 1 1 1 1 1 1 1 1 1
symmnumber: 1
zpe: 709201.2 jmol-1
zpe.correction: 0.270120 hartree
zpe.thermalcorrener: 0.286710 hartree
zpe.thermalcorrenthalpy: 0.287654 hartree
zpe.thermalcorrgfe: 0.223384 hartree
zpe.sumelectzpe: -836.297939 hartree
zpe.sumelectthermal: -836.281350 hartree
zpe.sumelectthermalent: -836.280406 hartree
zpe.sumelectthermalfe: -836.344675 hartree
dipole: 2.8465 -0.1811 1.6391
dipole: 3.2897
quadrupole: -136.9607 -122.5471 -127.7941
quadrupole: -5.5770 -4.1333 -5.0029
quadrupole: -7.8601 6.5536 1.3065 -5.5770 -4.1333 -5.0029
hfenergy: -836.5680596 hartree
pointgroup: C01 [X(C18H14Br1N1O1)]
dipole: 1.0125999 -0.2367366 0.7705373 debye
polarizability: 315.0201878|-16.5306511|227.9693698|20.3645229|-3.3911882|138.2635829 unknown
InChI: InChI=1S/C18H14BrNO/c19-14-6-8-15(9-7-14)20-11-17-16-4-2-1-3-13(16)5-10-18(17)21-12-20/h1-10H,11-12H2
charge 0 multiplicity 1
35 atoms
Br -6.324436 -0.689053 -2.146092
O  0.03293 2.370979 0.670547
N  -1.197558 0.335383 1.230865
C  -0.016391 -0.560884 1.139991
C  1.180491 0.178723 0.532091
C  2.369423 -0.544369 0.153778
C  1.12317 1.562951 0.281551
C  -0.839009 1.654585 1.666832
C  3.457922 0.154349 -0.501709
C  -2.347888 0.113262 0.421731
C  2.186764 2.253039 -0.381465
C  3.32737 1.559624 -0.766633
C  2.520144 -1.951824 0.399636
C  4.635053 -0.568088 -0.879045
C  -2.872745 -1.202227 0.280302
C  -3.023683 1.185212 -0.227278
C  3.682569 -2.630685 0.021396
C  4.752123 -1.936928 -0.624171
C  -4.034092 -1.443143 -0.481512
C  -4.198637 0.95241 -0.973026
C  -4.694571 -0.360272 -1.097292
H  -0.278568 -1.41727 0.495276
H  0.236795 -0.971487 2.140234
H  -1.713509 2.303459 1.803604
H  -0.250582 1.58591 2.601926
H  2.071561 3.326576 -0.558227
H  4.146916 2.084139 -1.27111
H  1.718036 -2.508231 0.89663
H  5.448342 -0.025143 -1.375629
H  -2.395562 -2.042559 0.795466
H  -2.61404 2.199128 -0.192886
H  3.777524 -3.703935 0.220913
H  5.656628 -2.480843 -0.916534
H  -4.426499 -2.459976 -0.573987
H  -4.702193 1.785789 -1.471671
