program: Gaussian 09
title: 000241243
version: EM64L-G09RevD.01
frameworkgroup: C1[X(C17H14ClNO)]
method: RPBEPBE
basis: SDD
operation: Freq
keyword: #p
keyword: freq=noraman
keyword: PBEPBE/SDD
title: #p freq=noraman PBEPBE/SDD
converged: YES YES NO NO
title: Mulliken charges:
elementType: Cl O N C C C C C C C C C C C C C C C C C H H H H H H H H H H H H H H
charge: -0.087093 -0.504832 -0.730386 0.290193 -0.797332 0.199779 0.457858 0.436361 0.148175 -0.365032 -0.463662 0.297206 -0.423239 -0.441124 -0.393144 -0.263847 -0.246486 -0.400238 -0.306447 -0.075003 0.237572 0.269261 0.240462 0.241122 0.218223 0.215110 0.240520 0.228354 0.229750 0.238233 0.250988 0.394559 0.295978 0.368160
chargesum: 0.00000
title: Mulliken charges with hydrogens summed into heavy atoms:
elementType: Cl O N C C C C C C C C C C C C C C C C C
charge: -0.087093 -0.136672 -0.039849 0.290193 -0.290500 0.199779 0.457858 0.436361 0.148175 -0.124570 -0.222540 0.297206 -0.205016 -0.200604 -0.178033 -0.035493 -0.016736 -0.162005 -0.055459 -0.075003
polarizability: 2.44551117e+02 -1.39090162e+01 2.42548560e+02 1.37154375e+01 -1.64131958e+01 1.29890435e+02
1716.lowfreq: -11.2232 -3.9292 -0.0017 -0.0010 0.0010 7.5800 31.5481 37.0609 71.3403
frequency: 31.4528 37.0549 71.3374 100.4297 140.0854 146.1591 178.9842 205.0746 219.3383 251.7339 275.2599 312.7114 317.0378 353.6754 369.0564 382.2591 411.3629 418.5610 430.2915 441.5360 462.0928 486.0952 516.7113 526.4578 535.3897 550.8533 576.4613 603.7473 635.1010 651.2696 670.4855 687.2039 710.4590 734.4294 751.3430 759.9782 783.6181 803.0822 810.1967 842.9151 857.0707 865.6127 874.2398 892.1550 930.1894 938.3102 963.5840 974.8634 989.8359 1033.8099 1039.0893 1053.9419 1091.1034 1134.4071 1145.7712 1161.2086 1169.1246 1180.2941 1183.8885 1210.6053 1237.0440 1241.3044 1272.7261 1280.3075 1300.9097 1320.6814 1366.6759 1389.9448 1406.0761 1423.6165 1431.2717 1435.8601 1467.6889 1476.0190 1497.2312 1518.6348 1574.2550 1591.5785 1608.9606 1615.8360 1636.1771 1679.1494 2989.6433 3042.3415 3110.7356 3112.6525 3121.8039 3136.2308 3145.5581 3146.9847 3158.5221 3179.4277 3190.3984 3446.2783 3602.5308 3649.5502
redmass: 7.6314 4.9196 5.4004 5.8073 5.0149 6.9000 6.7988 4.7982 4.7599 4.9068 4.6448 3.6147 4.5449 1.2321 2.7083 4.7269 1.3945 2.9788 6.5425 2.9679 3.2754 3.6156 4.4691 3.5207 3.8208 5.4936 5.0988 4.3447 2.6275 1.3072 5.0932 4.2717 5.8138 3.8823 1.3538 2.9218 1.5838 1.5304 2.4829 1.5869 4.5754 2.6896 1.9208 5.4645 1.3683 1.3398 1.4082 2.6076 1.3440 2.3198 2.3973 2.5002 1.7435 1.3330 1.4356 1.1573 1.2979 1.2905 2.2506 1.6162 1.6245 3.4495 1.5668 1.4337 2.0017 1.5333 2.3623 5.1888 3.3408 4.1702 4.3215 2.9422 2.5926 1.2537 2.4917 3.8120 7.1059 7.6784 5.8100 6.8123 6.7513 1.1448 1.0597 1.1007 1.0879 1.0894 1.0867 1.0904 1.0965 1.0920 1.0978 1.0948 1.0932 1.0559 1.0661 1.0953
irintensity: 0.2938 0.0222 0.0390 0.6230 0.6800 0.5169 0.3636 0.2017 6.7077 1.5834 9.4004 5.5089 4.7157 94.8563 10.5636 16.5995 97.8291 19.8283 2.4815 15.9228 2.4845 6.5284 3.3912 0.7315 9.3920 0.3477 4.9455 21.6173 51.8969 123.5507 5.5914 1.6004 6.4433 14.7051 29.0177 4.3554 38.5036 66.8644 33.5583 31.7857 9.2217 9.9747 9.2308 69.8224 5.3176 0.7987 5.9339 76.7903 0.3620 3.2065 23.7508 13.4641 15.7884 29.9608 48.2132 28.1162 8.2903 14.1036 12.8594 2.2126 34.8667 87.5718 0.7626 12.4723 2.8968 4.9492 8.3171 25.8585 15.0717 7.7044 13.2541 2.7049 7.0625 33.3519 83.9834 33.2095 40.3458 4.0490 13.9146 120.5202 20.4161 132.4948 21.6646 4.1986 11.1954 22.9480 2.5834 13.7364 21.4618 5.6011 33.1596 1.6947 8.3028 288.3701 53.1270 64.1520
temp: 298.150 k
press: 1.00000 atm
elementType: 17 8 7 6 6 6 6 6 6 6 6 6 6 6 6 6 6 6 6 6 1 1 1 1 1 1 1 1 1 1 1 1 1 1
symmnumber: 1
zpe: 691950.0 jmol-1
zpe.correction: 0.263550 hartree
zpe.thermalcorrener: 0.280245 hartree
zpe.thermalcorrenthalpy: 0.281189 hartree
zpe.thermalcorrgfe: 0.219072 hartree
zpe.sumelectzpe: -1244.875961 hartree
zpe.sumelectthermal: -1244.859266 hartree
zpe.sumelectthermalent: -1244.858322 hartree
zpe.sumelectthermalfe: -1244.920439 hartree
dipole: -5.0144 3.1851 -0.2990
dipole: 5.9480
quadrupole: -130.0353 -99.4847 -122.8852
quadrupole: -2.4902 6.4514 -8.4548
quadrupole: -12.5669 17.9837 -5.4168 -2.4902 6.4514 -8.4548
hfenergy: -1245.1395111 hartree
pointgroup: C01 [X(C17H14Cl1N1O1)]
dipole: -1.4773095 -1.8143771 -0.0421247 debye
polarizability: 235.1887166|12.3884391|254.1552683|-11.2229433|-4.8728677|127.6461282 unknown
InChI: InChI=1S/C17H14ClNO/c18-13-7-5-12(16(19)10-13)9-15-14-4-2-1-3-11(14)6-8-17(15)20/h1-8,10,20H,9,19H2
charge 0 multiplicity 1
34 atoms
Cl 5.095697 2.503574 0.989576
O  -0.050138 -3.191786 -0.901098
N  2.256447 -1.798044 0.227366
C  -0.813083 -0.907941 -0.707156
C  0.341995 -0.479101 -1.620935
C  -1.772647 0.036021 -0.175998
C  1.5219 0.23988 -0.956143
C  -2.887967 -0.432424 0.628293
C  -1.009452 -2.263677 -0.405254
C  -1.678269 1.447289 -0.425507
C  -3.025897 -1.833136 0.891981
C  2.412098 -0.446475 -0.060805
C  -2.098849 -2.738968 0.386494
C  -3.841735 0.507176 1.140741
C  1.791193 1.592877 -1.261354
C  -2.624763 2.339887 0.083291
C  -3.718493 1.871474 0.875786
C  3.493707 0.272335 0.533289
C  2.867978 2.313446 -0.694384
C  3.691737 1.620878 0.210933
H  -0.064654 0.189639 -2.40247
H  0.707233 -1.3807 -2.147381
H  -0.840981 1.833816 -1.009643
H  -3.868346 -2.183425 1.498834
H  -2.196398 -3.812537 0.594839
H  1.14487 2.109574 -1.982957
H  -4.675512 0.132007 1.746417
H  -2.525853 3.411814 -0.120734
H  -4.451053 2.583323 1.271023
H  4.172437 -0.234135 1.227643
H  3.053624 3.359799 -0.947106
H  1.537685 -2.374421 -0.218924
H  2.917981 -2.252247 0.851252
H  -0.354092 -4.121291 -0.763012
