program: Gaussian 09
title: 000241240
version: EM64L-G09RevD.01
frameworkgroup: C1[X(C16H16O3)]
method: RPBEPBE
basis: SDD
operation: Freq
keyword: #pfreq=noraman
keyword: PBEPBE/SDD
title: #p freq=noraman PBEPBE/SDD
converged: YES YES NO NO
title: Mulliken charges:
elementType: O O O C C C C C C C C C C C C C C C C H H H H H H H H H H H H H H H H
charge: -0.281110 -0.287060 -0.232090 -0.414376 0.428264 0.361728 0.343300 -0.353802 -0.327789 -0.382894 -0.423037 -0.378787 -0.326900 -0.218802 -0.223138 -0.484741 -0.239411 0.248032 -0.657298 0.223437 0.222790 0.254809 0.251364 0.259800 0.229135 0.257147 0.300838 0.226849 0.227296 0.245768 0.245912 0.229230 0.228830 0.216060 0.230645
chargesum: 0.00000
title: Mulliken charges with hydrogens summed into heavy atoms:
elementType: O O O C C C C C C C C C C C C C C C C
charge: -0.281110 -0.287060 -0.232090 0.031851 0.428264 0.361728 0.343300 -0.098993 -0.076425 -0.123094 -0.193902 -0.121639 -0.026062 0.008047 0.004158 0.006939 -0.010181 0.248032 0.018238
polarizability: 3.02366116e+02 -2.63798203e+00 1.71431689e+02 3.67638072e+00 5.23026508e+00 9.16390476e+01
1716.lowfreq: -4.6024 -2.5607 -0.0008 -0.0001 0.0010 9.6962 15.8054 20.9899 35.1215
frequency: 15.6411 20.9642 34.7904 38.3294 48.4968 60.6305 97.2889 106.9663 161.5074 168.3559 198.2348 214.4705 251.8171 275.5350 335.2910 340.6820 368.5452 401.3597 417.5287 446.3740 486.7347 516.1498 521.7494 534.0294 601.9753 614.2047 619.0270 661.2251 701.8801 713.7409 731.6531 746.9795 791.5292 801.3476 815.1413 829.7090 835.2630 854.7058 855.3931 913.2298 951.9551 964.1538 976.5113 978.9458 990.0842 996.0599 998.6984 1011.5194 1013.2548 1027.6444 1074.4764 1084.7581 1086.0560 1108.8383 1117.6273 1153.3163 1172.6321 1183.0383 1186.8707 1205.0359 1222.8188 1231.5427 1243.0892 1297.7917 1314.6248 1334.6635 1356.4816 1378.5105 1391.0202 1400.1708 1421.1976 1440.4579 1442.0447 1469.0742 1472.2251 1481.0325 1485.3787 1489.9731 1588.0483 1596.1547 1616.2393 1619.0956 1649.2842 2935.9027 2997.3963 2997.8269 3000.8375 3045.2277 3097.9520 3103.7816 3115.5497 3128.3549 3142.0131 3157.1912 3158.1248 3163.4353 3170.0778 3177.8511 3209.2212
redmass: 4.4580 4.2785 3.3190 3.0776 4.4147 3.6466 4.1880 4.1937 5.2175 2.8352 1.4829 4.2597 3.5193 4.8083 4.7994 5.5037 6.7561 2.8285 3.1016 3.5195 3.5660 2.5851 6.5632 2.7369 5.7423 6.5557 6.5282 4.7795 2.1886 3.7303 3.4490 1.8750 1.3361 5.5914 1.2655 4.2782 1.6214 4.8068 1.2622 1.3403 1.3321 1.3293 5.3638 1.4945 6.0986 1.3424 2.8426 1.8354 1.7401 2.1397 2.8482 1.6018 1.5672 1.8399 1.7714 2.2098 1.0542 1.4720 1.1265 1.2250 2.1889 3.5093 1.1745 1.2835 1.3733 1.7564 1.7528 6.4473 3.7366 1.2130 3.7180 2.1349 1.0880 1.2360 1.0390 1.0559 2.3486 1.9687 7.8907 6.2019 6.3715 6.0915 9.5698 1.0577 1.1027 1.0544 1.0428 1.0988 1.1003 1.1004 1.0874 1.0868 1.0927 1.0881 1.0966 1.0899 1.0991 1.0975 1.0945
irintensity: 0.3438 0.2884 0.7178 3.7598 0.5890 0.8299 0.4492 2.2593 1.3241 3.9318 4.5118 1.5503 2.1326 3.9756 10.3941 4.6643 0.0489 0.8836 0.0497 4.2309 9.0537 18.2644 0.9756 1.0205 6.7453 0.9299 3.0005 1.0821 34.2701 0.0713 29.0649 58.1920 15.6386 4.6503 6.8615 11.9075 94.9725 8.5262 0.4900 6.1438 2.4722 1.0081 88.6003 9.6800 0.3062 0.7823 5.6137 54.1785 10.3129 10.0009 186.6479 0.4806 10.0845 303.8649 248.4205 161.3191 0.3711 243.7025 5.6693 7.7602 4.5039 89.1556 0.1242 0.7872 12.7429 48.4551 22.0587 7.3155 14.3521 21.5809 1.6002 17.9761 28.1969 147.2363 12.6199 24.4247 23.9912 171.8304 10.8817 0.8521 43.7510 0.9573 172.8413 26.7536 28.9264 32.5744 13.3470 4.1270 30.0896 32.0703 9.1678 0.7127 28.1952 8.5406 32.6238 13.8559 11.0080 3.5813 4.2143
temp: 298.150 k
press: 1.00000 atm
elementType: 8 8 8 6 6 6 6 6 6 6 6 6 6 6 6 6 6 6 6 1 1 1 1 1 1 1 1 1 1 1 1 1 1 1 1
symmnumber: 1
zpe: 729552.3 jmol-1
zpe.correction: 0.277872 hartree
zpe.thermalcorrener: 0.295763 hartree
zpe.thermalcorrenthalpy: 0.296708 hartree
zpe.thermalcorrgfe: 0.228007 hartree
zpe.sumelectzpe: -843.597655 hartree
zpe.sumelectthermal: -843.579763 hartree
zpe.sumelectthermalent: -843.578819 hartree
zpe.sumelectthermalfe: -843.647520 hartree
dipole: -0.3148 0.4178 0.0745
dipole: 0.5284
quadrupole: -90.7833 -105.5111 -115.3519
quadrupole: 11.1587 -1.6846 2.6556
quadrupole: 13.0988 -1.6290 -11.4698 11.1587 -1.6846 2.6556
hfenergy: -843.8755268 hartree
pointgroup: C01 [X(C16H16O3)]
dipole: 0.1222716 -0.029834 -0.1654704 debye
polarizability: 301.8446041|9.9693767|92.3625444|-4.9431988|7.0428803|171.2297043 unknown
InChI: InChI=1S/C16H16O3/c1-2-16(17)19-15-10-8-14(9-11-15)18-12-13-6-4-3-5-7-13/h3-11H,2,12H2,1H3
charge 0 multiplicity 1
35 atoms
O  1.580901 0.143202 -0.512161
O  -4.052294 -0.09374 -0.645898
O  -4.72683 -0.445956 1.584179
C  2.356157 -0.036347 0.726875
C  3.832886 0.01474 0.386918
C  0.182311 0.061536 -0.418092
C  -2.632994 -0.059488 -0.459202
C  -0.515979 0.214398 -1.643208
C  -0.538011 -0.150236 0.781918
C  4.31438 -0.453058 -0.860286
C  4.754708 0.49448 1.349691
C  -1.917931 0.153726 -1.662193
C  -1.951858 -0.212753 0.767908
C  5.699889 -0.445315 -1.135684
C  6.141385 0.493624 1.077707
C  -6.39383 -0.258557 -0.238142
C  6.618403 0.022887 -0.1672
C  -5.002974 -0.283465 0.377207
C  -7.509755 -0.404146 0.811085
H  2.09081 -1.01933 1.173691
H  2.09395 0.757488 1.455988
H  0.056379 0.380643 -2.56033
H  -0.023564 -0.266179 1.739959
H  3.598154 -0.802206 -1.61022
H  4.391045 0.873353 2.313389
H  -2.474642 0.269775 -2.596625
H  -2.505573 -0.375598 1.692684
H  6.063079 -0.804202 -2.105362
H  6.844824 0.86717 1.830223
H  -6.443713 -1.068664 -0.991302
H  -6.496473 0.683986 -0.808856
H  7.692821 0.026603 -0.382252
H  -7.471941 0.417276 1.546784
H  -8.498738 -0.389452 0.320424
H  -7.408787 -1.350894 1.368379
