program: Gaussian 09
title: 000241242
version: EM64L-G09RevD.01
frameworkgroup: C1[X(C16H19NO)]
method: RPBEPBE
basis: SDD
operation: Freq
keyword: #p
keyword: freq=noraman
keyword: PBEPBE/SDD
title: #p freq=noraman PBEPBE/SDD
converged: NO YES NO NO
title: Mulliken charges:
elementType: O N C C C C C C C C C C C C C C C C H H H H H H H H H H H H H H H H H H H
charge: -0.403428 -0.314364 -0.010519 -0.422903 -0.409329 -0.399257 -0.393752 0.111826 -0.735689 0.297343 0.120097 0.419089 -0.379021 -0.363576 -0.448065 -0.441539 -0.273566 -0.253406 0.211662 0.181646 0.218667 0.194551 0.228545 0.208191 0.202166 0.230464 0.201743 0.206801 0.217912 0.217292 0.250873 0.222716 0.239098 0.238961 0.224231 0.227270 0.377269
chargesum: 0.00000
title: Mulliken charges with hydrogens summed into heavy atoms:
elementType: O N C C C C C C C C C C C C C C C C
charge: -0.026159 -0.314364 0.201143 -0.022589 0.013767 0.011100 0.038455 0.111826 -0.093684 0.297343 0.120097 0.419089 -0.128148 -0.140861 -0.208967 -0.202577 -0.049335 -0.026136
polarizability: 2.18977787e+02 8.10126651e+00 2.17416999e+02 7.23459866e+00 -4.36377697e+00 1.14524304e+02
1716.lowfreq: -0.0009 -0.0007 -0.0004 5.1288 9.0827 15.7480 35.7706 60.3478 69.5647
frequency: 34.6645 60.3132 69.5010 123.2953 144.8606 159.1654 180.0370 208.9465 215.7647 244.6055 265.8741 299.3954 316.8650 356.8964 370.8604 405.7016 415.1132 430.7967 448.9565 478.0782 516.1996 521.3562 528.3388 580.2713 615.5659 672.7711 692.3017 718.1496 757.0204 773.5455 793.6626 810.5788 818.6309 828.1398 840.4326 868.7489 876.5307 885.0008 900.3853 948.8013 951.8061 964.5441 970.0255 972.0327 982.9007 985.7676 1029.5358 1046.9724 1075.0753 1095.8641 1122.7176 1139.0386 1141.0004 1143.1280 1168.8950 1177.4586 1191.7598 1198.0696 1223.4036 1232.6101 1266.0433 1279.6807 1294.3520 1299.5842 1313.9613 1329.4115 1334.7451 1344.1318 1357.6792 1370.8007 1385.1968 1389.8560 1398.6668 1416.7058 1440.1256 1446.5972 1455.8237 1461.0225 1466.7761 1471.7980 1476.6984 1478.4567 1523.7014 1585.9153 1600.1825 1629.6623 2906.0004 2920.4572 2951.5748 2967.6174 2982.4659 2986.5728 3024.5397 3046.0742 3051.8804 3061.8415 3064.5795 3068.8280 3118.8722 3129.7233 3131.4226 3157.0988 3160.8530 3171.6670 3183.0473
redmass: 3.6463 3.7939 3.2966 5.8881 2.7985 3.5040 3.0079 1.0962 3.3124 3.3258 2.8733 3.0126 2.7684 3.8105 3.3643 2.2134 2.4701 7.0136 3.1469 3.8282 2.7043 5.2793 3.4024 3.2749 4.3249 4.5068 3.5806 5.7555 1.2936 2.5121 2.8323 1.9030 1.6998 1.4964 1.4878 1.5626 1.6245 2.4951 2.7393 1.3687 3.1828 2.0311 1.4002 1.9665 1.5837 1.3420 2.1451 2.1594 1.8713 2.6110 2.8866 1.7962 1.4165 1.4274 1.1184 1.6327 1.9084 1.7959 1.5092 1.7999 1.6945 1.1651 1.3014 2.0734 1.4233 1.8053 1.3730 1.5525 1.3966 1.3997 2.3256 1.2590 3.2231 5.0386 2.6805 1.1256 1.5791 1.4453 1.0883 1.1090 1.0527 1.0546 4.3321 6.2906 6.2826 6.6194 1.0699 1.0708 1.0642 1.0362 1.0811 1.0624 1.0970 1.0997 1.0931 1.0965 1.0962 1.0993 1.0868 1.0892 1.0896 1.0973 1.0603 1.0958 1.0927
irintensity: 0.1110 0.2406 0.4394 0.1039 0.3483 0.0550 0.9536 0.3632 6.0338 4.4706 0.3929 0.2146 1.2836 36.8129 2.4807 0.3982 1.9197 2.8221 9.2894 6.7930 6.3689 2.1284 0.0926 1.5444 3.8604 5.7761 4.8948 5.8361 48.1874 0.6996 0.5041 42.1227 54.9160 48.2639 22.2128 12.5769 0.7380 1.7371 5.0477 1.6594 20.3769 5.9813 3.8788 20.5773 10.7016 0.2564 3.7119 14.3824 24.8666 5.3735 18.3804 6.9215 1.3024 1.6195 17.6992 43.6129 40.6782 91.0793 7.7574 11.0748 14.0572 8.8098 3.1947 50.9347 12.8946 11.7276 4.6365 1.4358 0.7276 9.5932 12.4052 21.1725 74.5124 24.8559 1.9724 4.8607 21.5250 19.1525 8.6843 9.2672 9.9641 17.4274 30.0099 11.1025 36.6902 34.8086 59.7614 73.3461 32.7529 49.4976 43.2417 32.6927 46.4984 49.7430 6.2140 29.0287 72.3370 37.0024 2.7787 2.4969 26.8304 35.5661 133.4868 21.6168 16.0960
temp: 298.150 k
press: 1.00000 atm
elementType: 8 7 6 6 6 6 6 6 6 6 6 6 6 6 6 6 6 6 1 1 1 1 1 1 1 1 1 1 1 1 1 1 1 1 1 1 1
symmnumber: 1
zpe: 818792.5 jmol-1
zpe.correction: 0.311862 hartree
zpe.thermalcorrener: 0.327533 hartree
zpe.thermalcorrenthalpy: 0.328478 hartree
zpe.thermalcorrgfe: 0.269276 hartree
zpe.sumelectzpe: -749.759959 hartree
zpe.sumelectthermal: -749.744288 hartree
zpe.sumelectthermalent: -749.743343 hartree
zpe.sumelectthermalfe: -749.802544 hartree
dipole: 1.6948 -1.8862 0.3136
dipole: 2.5551
quadrupole: -95.1567 -110.7602 -109.8717
quadrupole: 1.1616 2.2771 0.0582
quadrupole: 10.1062 -5.4973 -4.6088 1.1616 2.2771 0.0582
hfenergy: -750.0718209 hartree
pointgroup: C01 [X(C16H19N1O1)]
dipole: 0.5866812 0.8151246 0.0440328 debye
polarizability: 219.7748423|-5.1792047|212.5239492|-12.6946833|18.6697634|118.6202991 unknown
InChI: InChI=1S/C16H19NO/c1-12-5-4-10-17(11-12)16-14-7-3-2-6-13(14)8-9-15(16)18/h2-3,6-9,12,18H,4-5,10-11H2,1H3
charge 0 multiplicity 1
37 atoms
O  0.326954 -3.204835 -0.743046
N  1.295543 -0.747707 -0.504616
C  2.902344 0.740154 0.825269
C  3.524308 1.187043 -0.523044
C  2.227255 -0.647645 0.651446
C  2.483935 1.178672 -1.668525
C  1.818726 -0.213869 -1.791989
C  -0.132492 -0.885501 -0.291093
C  3.958184 0.683457 1.949256
C  -1.073773 0.156784 0.032132
C  -0.598618 -2.214879 -0.430817
C  -2.475363 -0.198998 0.200862
C  -1.970552 -2.566431 -0.264854
C  -0.708741 1.534511 0.199604
C  -2.886733 -1.565587 0.045558
C  -3.428365 0.822022 0.521026
C  -1.661971 2.506775 0.512575
C  -3.037708 2.153832 0.675539
H  2.123444 1.474353 1.115132
H  4.355015 0.493128 -0.777397
H  3.974077 2.193202 -0.416261
H  3.045076 -1.394075 0.520989
H  1.67192 -0.92666 1.56438
H  1.714917 1.953858 -1.490332
H  2.973084 1.426895 -2.631067
H  0.987236 -0.193495 -2.517304
H  2.584925 -0.919644 -2.185507
H  4.753111 -0.049229 1.708567
H  4.441384 1.668226 2.088921
H  3.506599 0.387984 2.914895
H  -2.268005 -3.611768 -0.387079
H  0.338266 1.821114 0.080398
H  -3.946503 -1.81466 0.175692
H  -4.480307 0.536231 0.643661
H  -1.353933 3.551453 0.635452
H  -3.775403 2.925462 0.920121
H  1.191763 -2.67497 -0.805142
