program: Gaussian 09
title: 000241225
version: EM64L-G09RevD.01
frameworkgroup: C1[X(C25H26N2O2)]
method: RPBEPBE
basis: SDD
operation: Freq
keyword: #p
keyword: freq=noraman
keyword: PBEPBE/SDD
title: #p freq=noraman PBEPBE/SDD
converged: YES YES NO NO
title: Mulliken charges:
elementType: O O N N C C C C C C C C C C C C C C C C C C C C C C C C C H H H H H H H H H H H H H H H H H H H H H H H H H H
charge: -0.254053 -0.249000 -0.125904 -0.121416 0.209315 0.394604 -0.447197 0.179530 -0.062853 -0.476884 0.135181 -0.591264 -0.299717 -0.291740 -0.496883 -0.494408 -0.833209 0.455474 0.455247 -0.370681 -0.446463 -0.369736 -0.447190 -0.229583 -0.219580 -0.228554 -0.219259 -0.244381 -0.244033 0.253724 0.204154 0.256709 0.204382 0.253936 0.224523 0.192801 0.223665 0.193712 0.220347 0.199190 0.219964 0.199270 0.232346 0.274189 0.215733 0.273683 0.230189 0.273143 0.230404 0.226928 0.224684 0.226831 0.224667 0.227738 0.227724
chargesum: 0.00000
title: Mulliken charges with hydrogens summed into heavy atoms:
elementType: O O N N C C C C C C C C C C C C C C C C C C C C C C C C C
charge: -0.254053 -0.249000 -0.125904 -0.121416 0.209315 0.394604 0.010681 0.179530 -0.062853 -0.015793 0.135181 -0.337328 0.117607 0.125638 -0.077346 -0.075174 -0.110941 0.455474 0.455247 -0.096998 -0.216274 -0.096594 -0.216786 -0.002655 0.005104 -0.001723 0.005408 -0.016642 -0.016309
polarizability: 3.72095826e+02 4.57681821e+00 2.49122346e+02 3.21248920e+01 -1.55238007e+00 2.34820268e+02
1716.lowfreq: -10.7013 -4.9333 -0.0007 -0.0005 0.0003 2.6045 6.1004 21.2496 25.5919
frequency: 3.0376 21.1942 25.5816 27.3074 33.2078 37.3762 70.9759 103.9889 109.2604 123.0766 131.4168 147.6056 173.1512 176.1851 189.0356 215.1727 220.0645 240.0033 267.5949 277.5403 299.7336 313.0438 326.3278 337.1750 348.3768 393.4743 404.8199 406.2380 407.8118 434.2163 455.5934 472.0749 496.5684 515.3282 517.9889 524.2249 574.9956 585.2860 597.2208 611.2388 615.8804 618.0181 635.9743 703.4302 706.0369 709.6271 723.9284 737.1349 747.2313 752.3128 797.0919 802.0509 803.2466 860.8253 861.2612 867.4646 869.9510 879.4770 914.8687 915.3226 928.0950 962.5016 970.6051 972.5390 983.5945 984.3939 986.1953 989.7844 990.0737 994.6681 1001.9326 1004.4406 1006.8286 1024.6339 1024.7118 1038.9372 1043.4397 1059.0306 1063.9626 1076.1271 1079.9629 1083.1811 1136.7184 1146.1355 1170.2402 1170.3232 1174.8518 1180.1959 1180.7768 1185.3455 1194.5052 1198.0385 1200.9221 1208.9857 1210.1612 1222.0403 1252.1944 1260.0166 1291.5571 1294.0285 1299.5620 1307.6103 1315.6313 1339.2782 1347.0208 1357.1758 1361.3734 1377.8018 1383.7338 1383.8297 1393.8696 1398.0374 1398.5338 1431.5877 1440.6553 1441.2332 1452.0310 1458.7548 1459.1447 1467.4070 1470.2104 1478.0787 1481.3978 1482.5556 1483.4182 1483.6493 1489.1082 1588.6546 1595.0396 1595.4583 1614.3550 1614.4481 1632.9472 2815.2504 2828.9407 2849.7236 2850.3649 2863.4261 2864.3324 2971.4589 2988.8563 2989.4598 3018.4456 3030.6079 3040.9688 3086.9827 3088.7238 3110.6516 3111.2544 3114.5376 3124.0141 3124.1592 3135.8557 3136.0772 3145.5617 3146.8436 3147.4100 3161.9785 3162.1653
redmass: 5.5951 4.4478 4.5413 4.5085 4.2040 4.3334 5.7743 3.6267 3.9355 2.2198 1.4004 2.5343 4.5559 3.4546 3.4967 3.8129 4.0625 3.9643 2.8183 3.7304 2.7846 2.5411 2.8759 2.7887 2.4757 3.4117 5.1506 2.8744 2.9195 4.9202 3.2683 3.3961 5.1971 5.5457 3.4624 5.2609 5.7999 5.1865 4.9672 5.2469 6.3643 6.1887 5.2877 3.2596 2.2626 2.9933 2.9876 4.0025 1.5365 1.7435 3.5165 4.0968 4.0760 1.2632 1.2581 1.5234 3.6776 3.6527 1.3890 1.3606 5.8544 5.6154 2.0255 1.9689 1.4969 1.3928 1.5593 5.3605 5.6451 1.7556 2.0509 1.3778 1.9504 2.1815 2.1804 1.6820 1.6590 2.2160 2.3649 2.3341 1.6136 1.8082 2.2888 2.0440 1.0637 1.0614 2.0864 1.1431 1.1223 1.6509 1.2660 1.1474 1.5167 2.4938 2.4961 1.7695 1.7403 1.6236 1.6914 1.5810 1.7719 1.4704 1.9792 1.3845 1.5122 1.9694 1.7118 2.2364 4.0958 3.9389 1.7500 1.7300 1.4389 2.6583 2.0613 2.0652 1.8437 1.1247 1.1221 1.1482 1.1178 1.2831 1.5170 1.5733 1.5111 1.4095 1.3740 8.5041 6.1336 6.1420 6.0959 6.0858 7.9070 1.0715 1.0716 1.0698 1.0698 1.0708 1.0709 1.0403 1.0869 1.0868 1.0852 1.0859 1.0962 1.0920 1.0920 1.0874 1.0874 1.0957 1.0861 1.0861 1.0912 1.0913 1.0918 1.0958 1.0955 1.1014 1.1014
irintensity: 0.0788 0.1009 0.2921 0.1806 0.2300 0.2680 0.9607 2.2672 3.5560 0.4222 0.2884 1.6775 0.1661 0.4826 1.2079 2.6177 2.2408 1.2043 2.9746 3.8095 0.9033 1.9904 6.2825 12.2472 1.1366 8.5886 11.7661 1.1052 1.7734 0.4423 7.2782 1.6561 16.5860 1.4543 1.0493 10.1928 9.6719 5.5388 0.2530 2.7731 0.0642 2.8179 0.9648 6.2056 71.8596 6.7305 5.8435 3.7957 116.7124 5.8665 1.6492 20.3892 12.3671 2.2525 1.3058 39.7055 22.7425 45.5269 8.6260 11.2225 12.3893 269.3586 10.6505 11.7196 0.9815 0.2289 1.0663 0.0493 0.1765 1.2001 9.7902 0.8054 27.1325 16.1037 17.5478 62.5261 45.9863 26.4220 25.4558 6.1275 21.8638 17.5481 271.6692 29.0171 0.3845 0.6874 7.2438 4.6443 1.1142 35.4512 36.0543 0.6518 29.4273 15.4315 19.0437 38.4961 25.7275 6.9397 39.3833 16.1677 4.5626 10.8062 30.1693 15.6663 11.3859 51.0881 10.0438 21.0592 36.4451 12.1529 8.8824 1.8286 17.6615 118.9019 9.3946 12.3208 3.5931 9.9110 6.3064 4.6579 3.3545 36.4757 23.4745 24.5003 17.7954 22.9885 23.0779 10.0576 0.6163 0.7136 6.1695 6.4942 6.6418 59.0755 54.3498 43.0679 65.0898 142.3042 280.3399 34.5635 20.5912 20.0101 15.3776 12.3210 19.4095 37.5530 31.2180 9.1812 9.3199 6.2245 0.3821 0.2787 14.6978 17.6078 4.1324 34.2811 29.5852 25.3679 29.5529
temp: 298.150 k
press: 1.00000 atm
elementType: 8 8 7 7 6 6 6 6 6 6 6 6 6 6 6 6 6 6 6 6 6 6 6 6 6 6 6 6 6 1 1 1 1 1 1 1 1 1 1 1 1 1 1 1 1 1 1 1 1 1 1 1 1 1 1
symmnumber: 1
zpe: 1183190.3 jmol-1
zpe.correction: 0.450653 hartree
zpe.thermalcorrener: 0.475911 hartree
zpe.thermalcorrenthalpy: 0.476855 hartree
zpe.thermalcorrgfe: 0.390790 hartree
zpe.sumelectzpe: -1226.091716 hartree
zpe.sumelectthermal: -1226.066458 hartree
zpe.sumelectthermalent: -1226.065514 hartree
zpe.sumelectthermalfe: -1226.151579 hartree
dipole: -0.0925 -1.8023 -0.1412
dipole: 1.8102
quadrupole: -141.2145 -159.9782 -172.8742
quadrupole: 0.6172 4.5002 -1.8137
quadrupole: 16.8078 -1.9559 -14.8519 0.6172 4.5002 -1.8137
hfenergy: -1226.5423693 hartree
pointgroup: C01 [X(C25H26N2O2)]
dipole: 0.0397334 0.2197774 0.6762568 debye
polarizability: 372.9920686|30.3224903|234.0011211|-3.0947162|1.9145513|249.0452496 unknown
InChI: InChI=1S/C25H26N2O2/c1-19-23-16-27(14-21-10-6-3-7-11-21)17-28-24(23)12-22-15-26(18-29-25(19)22)13-20-8-4-2-5-9-20/h2-12H,13-18H2,1H3
charge 0 multiplicity 1
55 atoms
O  -1.604586 2.354449 1.155781
O  1.527757 -2.315575 1.503293
N  3.518531 -1.065692 0.986035
N  -3.587235 1.022596 0.843834
C  1.394208 0.152727 1.257889
C  -1.446712 -0.113355 1.278943
C  2.911568 0.266801 1.170412
C  0.580889 1.314616 1.187223
C  -0.83072 1.16555 1.215725
C  -2.963694 -0.260039 1.224162
C  0.777116 -1.121296 1.383755
C  -0.624167 -1.252845 1.378364
C  2.933627 -2.057732 1.872793
C  -3.004345 2.137852 1.571828
C  4.982886 -1.083201 0.838539
C  -5.053717 1.004195 0.715438
C  1.200013 2.693983 1.060016
C  5.456715 -0.472268 -0.481022
C  -5.53345 0.182909 -0.482209
C  4.70855 -0.656706 -1.670365
C  6.677155 0.243536 -0.540303
C  -4.80411 0.190993 -1.697412
C  -6.737047 -0.559214 -0.406919
C  5.177662 -0.139835 -2.897967
C  7.151891 0.7575 -1.769204
C  -5.275701 -0.525177 -2.819345
C  -7.213807 -1.273645 -1.530448
C  6.403164 0.566112 -2.953094
C  -6.484217 -1.257593 -2.741388
H  3.18939 0.899974 0.307658
H  3.316535 0.782616 2.081939
H  -3.236136 -1.019512 0.469346
H  -3.35112 -0.629709 2.209857
H  -1.058491 -2.256248 1.44377
H  3.453344 -3.022554 1.767413
H  2.927874 -1.739644 2.946401
H  -3.534441 3.07288 1.33301
H  -2.986318 1.978333 2.680043
H  5.304086 -2.143995 0.878971
H  5.502033 -0.561506 1.681628
H  -5.386078 2.054722 0.587842
H  -5.557232 0.620711 1.63845
H  1.685177 2.826158 0.072735
H  0.431328 3.473812 1.164354
H  1.978576 2.862228 1.828062
H  3.757257 -1.19771 -1.610474
H  7.258494 0.401536 0.37745
H  -3.863643 0.752393 -1.738714
H  -7.302947 -0.581374 0.533509
H  4.589563 -0.287272 -3.811092
H  8.098078 1.30975 -1.801553
H  -4.701967 -0.514058 -3.753195
H  -8.146361 -1.845095 -1.459135
H  6.767171 0.966331 -3.906171
H  -6.849496 -1.814112 -3.611955
