program: Gaussian 09
title: 000241209
version: EM64L-G09RevD.01
frameworkgroup: C1[X(C15H13Cl2NO)]
method: RPBEPBE
basis: SDD
operation: Freq
keyword: #p
keyword: freq=noraman
keyword: PBEPBE/SDD
title: #p freq=noraman PBEPBE/SDD
converged: YES YES NO NO
title: Mulliken charges:
elementType: Cl Cl O N C C C C C C C C C C C C C C C H H H H H H H H H H H H H
charge: -0.022576 -0.059665 -0.220589 -0.128554 -0.457964 -0.495630 0.370029 -0.290457 0.263642 0.454506 -0.372748 -0.273982 -0.101649 -0.368569 -0.446704 -0.240942 -0.226532 -0.217558 -0.242379 0.261418 0.216798 0.224145 0.205502 0.232823 0.206654 0.260179 0.270041 0.231696 0.281462 0.229734 0.227305 0.230564
chargesum: 0.00000
title: Mulliken charges with hydrogens summed into heavy atoms:
elementType: Cl Cl O N C C C C C C C C C C C C C C C
charge: -0.022576 -0.059665 -0.220589 -0.128554 0.020252 -0.065984 0.370029 0.149019 0.263642 0.454506 -0.112569 -0.273982 -0.101649 -0.098527 -0.215008 0.040520 0.003202 0.009747 -0.011815
polarizability: 2.27450895e+02 -8.69745675e+00 1.91291924e+02 2.33913818e+01 9.84371408e-01 1.39223859e+02
1716.lowfreq: -8.2463 -3.4058 -0.0021 -0.0010 0.0020 7.8432 18.6552 25.7185 33.2561
frequency: 18.5682 25.6665 33.2508 89.9384 98.3489 142.4815 151.7998 164.3930 176.2824 204.0912 218.4145 286.8095 300.3819 319.7567 342.2901 365.0098 385.6792 405.8861 427.0628 470.2976 484.8677 505.5196 546.6722 556.7486 594.4547 616.1049 660.8498 681.8963 707.2501 719.3677 748.5897 791.0287 807.1313 858.5648 861.0242 866.5791 873.9835 897.4977 916.0420 929.8889 977.9758 985.0418 989.5337 991.1550 1004.4829 1024.8643 1049.2847 1080.7956 1088.0020 1140.1138 1145.8793 1171.8317 1182.3361 1191.1889 1199.6849 1209.3117 1211.3484 1237.5327 1262.9644 1296.2372 1310.7607 1340.5115 1360.4883 1373.4478 1379.5756 1393.7714 1410.1115 1440.6568 1442.5043 1460.8054 1468.0161 1480.1948 1484.0420 1567.3447 1596.1873 1603.8508 1614.4360 2842.0573 2871.9111 2883.6669 2995.2106 3033.8023 3103.7288 3112.4845 3126.0952 3137.5707 3148.3432 3153.4227 3164.1095 3185.0328
redmass: 6.8293 6.7422 3.9830 4.6808 5.8783 6.8078 5.7017 14.4254 3.7616 4.4898 4.0084 4.5047 2.9887 2.7599 8.4764 4.5770 9.5419 2.8660 3.8328 3.6337 4.0866 5.1695 4.9069 5.0871 5.2192 6.3452 7.0200 5.4134 2.0838 5.5536 1.5832 5.6652 4.8791 1.4004 1.2664 1.5030 3.3358 4.7486 1.4904 5.7226 1.8830 1.4069 3.1693 2.3157 1.3698 2.1929 1.9681 1.6025 1.9127 3.3752 2.0140 1.0586 1.1209 1.1944 1.7211 1.5436 2.3318 2.3094 1.7083 1.5470 1.4936 1.3343 1.8059 7.4179 2.3693 2.4952 3.4767 2.5236 2.1010 1.1468 1.1634 1.3123 1.7042 7.9632 6.1305 8.2897 6.0818 1.0713 1.0695 1.0710 1.0880 1.0865 1.0932 1.0877 1.0860 1.0910 1.0958 1.0928 1.1014 1.0935
irintensity: 0.1510 0.2289 0.0638 0.6746 1.8561 0.1899 1.1861 1.1011 1.4575 1.9895 0.6008 6.6223 0.3999 10.5087 4.2905 5.3371 1.7425 0.1452 3.7396 8.0586 2.8027 4.4801 5.6692 8.8048 2.8236 0.2950 52.1711 2.7368 37.6038 12.5290 51.2293 49.8650 9.8772 30.4942 1.5001 29.1868 24.9538 56.8118 42.9223 79.2348 14.0079 1.3667 0.7027 0.5083 1.3580 16.7658 19.7481 10.8418 3.5454 118.3336 76.8482 0.6602 0.9461 10.7891 52.3024 33.9086 17.3108 37.3231 6.8177 22.1797 7.0664 13.4107 43.0355 11.4996 16.9178 1.2808 20.9898 151.7986 20.8942 7.4264 29.8239 19.6695 9.9027 38.5223 0.7297 3.5445 4.8373 55.6924 42.1871 190.3875 17.3372 8.2742 22.1314 9.5425 0.0729 12.4328 31.8845 0.9942 24.9614 0.6832
temp: 298.150 k
press: 1.00000 atm
elementType: 17 17 8 7 6 6 6 6 6 6 6 6 6 6 6 6 6 6 6 1 1 1 1 1 1 1 1 1 1 1 1 1
symmnumber: 1
zpe: 635062.6 jmol-1
zpe.correction: 0.241883 hartree
zpe.thermalcorrener: 0.258458 hartree
zpe.thermalcorrenthalpy: 0.259402 hartree
zpe.thermalcorrgfe: 0.194961 hartree
zpe.sumelectzpe: -1628.111924 hartree
zpe.sumelectthermal: -1628.095349 hartree
zpe.sumelectthermalent: -1628.094405 hartree
zpe.sumelectthermalfe: -1628.158846 hartree
dipole: -4.1068 0.0463 -2.3946
dipole: 4.7541
quadrupole: -124.4251 -128.2418 -118.4324
quadrupole: -1.4063 3.5583 5.6118
quadrupole: -0.7254 -4.5421 5.2674 -1.4063 3.5583 5.6118
hfenergy: -1628.353807 hartree
pointgroup: C01 [X(C15H13Cl2N1O1)]
dipole: -1.4887384 -0.0260704 -1.1320128 debye
polarizability: 221.0609833|-7.9373182|190.7037784|33.2918861|1.3683203|146.2019161 unknown
InChI: InChI=1S/C15H13Cl2NO/c16-13-6-12-9-18(8-11-4-2-1-3-5-11)10-19-15(12)14(17)7-13/h1-7H,8-10H2
charge 0 multiplicity 1
32 atoms
Cl 3.954966 -2.144169 1.69111
Cl 4.092015 3.277806 0.479321
O  1.404128 -2.113406 0.142903
N  -0.600064 -1.10126 -0.739845
C  0.016021 0.197409 -1.062526
C  -1.988088 -1.302151 -1.189878
C  1.375632 0.309081 -0.379415
C  0.329167 -2.199082 -0.886825
C  1.975283 -0.838287 0.214492
C  -2.984679 -0.397894 -0.463528
C  2.032991 1.557982 -0.301377
C  3.201492 -0.692127 0.911514
C  3.255928 1.6600 0.381044
C  -2.832776 -0.122529 0.918484
C  -4.099181 0.136744 -1.154108
C  3.855768 0.548282 1.00472
C  -3.783609 0.670134 1.597946
C  -5.055629 0.926326 -0.474544
C  -4.900369 1.19491 0.904706
H  -0.647232 1.000278 -0.693852
H  0.126971 0.346404 -2.167619
H  -2.246463 -2.361416 -0.988103
H  -2.101361 -1.151213 -2.291419
H  -0.168368 -3.163205 -0.706249
H  0.858551 -2.214865 -1.870991
H  1.579291 2.444325 -0.756192
H  -1.959777 -0.527883 1.442822
H  -4.220738 -0.063434 -2.226567
H  4.803146 0.637927 1.541117
H  -3.655653 0.87815 2.666321
H  -5.91414 1.334242 -1.019958
H  -5.638123 1.809422 1.432695
