program: Gaussian 09
title: 000241206
version: EM64L-G09RevD.01
frameworkgroup: C1[X(C14H12N2O3)]
method: RPBEPBE
basis: SDD
operation: Freq
keyword: #p
keyword: freq=noraman
keyword: PBEPBE/SDD
title: #p freq=noraman PBEPBE/SDD
converged: YES YES NO NO
title: Mulliken charges:
elementType: O O O N N C C C C C C C C C C C C C C H H H H H H H H H H H H
charge: -0.216628 -0.217562 -0.181296 -0.170418 0.009831 -0.530950 0.351873 -0.432887 0.091483 0.459436 -0.381817 0.251024 -0.230852 -0.351281 -0.393046 -0.348614 -0.209525 -0.232054 -0.252093 0.249276 0.253234 0.257758 0.266211 0.236254 0.240124 0.284434 0.231519 0.278109 0.226527 0.230229 0.231700
chargesum: 0.00000
title: Mulliken charges with hydrogens summed into heavy atoms:
elementType: O O O N N C C C C C C C C C C C C C C
charge: -0.216628 -0.217562 -0.181296 -0.170418 0.009831 -0.028440 0.351873 0.091083 0.091483 0.459436 -0.145563 0.251024 0.009271 -0.066846 -0.161527 -0.070505 0.017002 -0.001825 -0.020393
polarizability: 2.23416912e+02 -3.53427240e+00 1.86000022e+02 1.48840901e+00 -2.56569103e+00 1.16993922e+02
1716.lowfreq: -5.6602 -0.0007 -0.0006 0.0004 6.9995 8.3369 19.7022 39.0995 44.5458
frequency: 19.6026 39.0594 44.5266 57.9471 121.2500 147.1367 176.2059 194.6838 246.3454 277.1729 323.4957 349.5353 361.2051 393.4747 403.9012 412.1045 461.8704 501.4414 522.3884 529.1510 547.4349 560.5792 594.7563 613.8225 668.6659 677.1182 698.4816 712.0149 736.6229 748.5092 760.5734 769.2441 794.6481 837.6377 847.2936 905.0032 906.6127 925.1874 966.7813 969.0745 976.8958 983.4750 986.3964 989.6166 1026.5522 1073.7846 1084.2459 1092.8122 1141.7572 1164.9848 1173.3490 1192.4123 1194.9343 1202.0347 1210.9418 1220.6506 1239.6674 1243.2020 1306.2391 1327.7925 1362.4843 1362.9658 1377.3690 1381.9053 1384.3873 1436.0088 1444.6209 1451.3829 1468.1361 1473.4942 1491.0351 1580.4714 1588.8803 1607.9325 1615.0250 2970.7972 3021.8143 3081.3775 3123.6573 3125.0367 3132.4797 3144.2894 3149.3481 3153.1319 3162.5406 3168.6480 3184.7861
redmass: 6.0400 8.5829 6.3466 4.5817 7.3711 3.9768 8.4592 4.0161 4.9990 3.4244 5.6137 5.0448 4.7618 3.9417 3.9068 3.0767 4.4677 5.9312 3.2587 3.9722 4.9420 3.8387 7.5098 6.3657 6.3876 7.4991 2.0284 7.3307 3.1284 8.2860 2.8257 2.1456 1.6943 1.2478 7.2895 2.2393 1.7529 1.7291 1.4377 1.9724 2.0512 1.7489 3.9038 1.4082 2.2485 1.9295 1.8158 1.8418 4.3576 1.3999 1.0522 1.8796 1.2597 2.1935 1.3581 3.0988 2.1662 1.8824 1.5252 1.3788 3.6517 1.6391 2.9748 3.9759 4.4090 2.5111 2.2613 1.4380 1.9288 1.1601 2.3822 6.9353 6.2780 6.9816 6.1696 1.0691 1.0671 1.0935 1.0898 1.0854 1.0874 1.0929 1.1016 1.0966 1.0910 1.1015 1.0973
irintensity: 0.0240 2.1450 1.5003 0.3386 3.1762 0.3865 2.7625 2.9362 0.8811 2.1094 3.0430 1.8179 0.3929 4.4341 6.7160 0.7091 9.3527 3.9209 3.7698 2.4751 9.3019 9.0417 19.9601 3.3748 10.4903 2.8055 26.5249 36.2662 37.8585 161.6748 27.2454 59.5669 28.7690 1.3626 171.8488 7.3472 16.2517 3.7844 1.6203 13.7814 25.9393 2.5332 7.8881 1.3810 15.5304 11.5374 26.9895 25.6738 72.7017 21.0344 0.8184 59.8960 75.8122 186.6481 15.4606 147.3670 56.0349 4.5527 13.0776 1.5143 126.7342 4.1089 13.5317 38.8585 15.6699 73.4355 1.5407 32.0788 78.4897 9.6568 114.4988 26.5460 7.2895 49.4583 63.9557 35.3540 53.1723 6.6869 9.3703 8.3721 1.1757 23.9688 7.3357 17.8836 9.8605 16.5491 4.9678
temp: 298.150 k
press: 1.00000 atm
elementType: 8 8 8 7 7 6 6 6 6 6 6 6 6 6 6 6 6 6 6 1 1 1 1 1 1 1 1 1 1 1 1
symmnumber: 1
zpe: 616664.8 jmol-1
zpe.correction: 0.234875 hartree
zpe.thermalcorrener: 0.250026 hartree
zpe.thermalcorrenthalpy: 0.250970 hartree
zpe.thermalcorrgfe: 0.190611 hartree
zpe.sumelectzpe: -874.415804 hartree
zpe.sumelectthermal: -874.400654 hartree
zpe.sumelectthermalent: -874.399710 hartree
zpe.sumelectthermalfe: -874.460068 hartree
dipole: -3.8484 5.6042 0.3942
dipole: 6.8097
quadrupole: -119.3564 -105.6877 -104.6760
quadrupole: 13.0671 0.1594 -0.4433
quadrupole: -9.4497 4.2190 5.2307 13.0671 0.1594 -0.4433
hfenergy: -874.6506794 hartree
pointgroup: C01 [X(C14H12N2O3)]
dipole: -1.3373727 2.2361417 0.623699 debye
polarizability: 222.6650927|-6.0870691|185.155569|-2.234807|10.7523272|118.5901949 unknown
InChI: InChI=1S/C14H12N2O3/c17-16(18)13-8-4-5-11-9-15(10-19-14(11)13)12-6-2-1-3-7-12/h1-8H,9-10H2
charge 0 multiplicity 1
31 atoms
O  0.54134 -1.107249 1.00543
O  4.180106 -1.799431 -0.74796
O  2.071993 -2.651809 -0.571323
N  -1.375628 0.389035 1.418573
N  2.903726 -1.668338 -0.554896
C  -0.566316 1.622788 1.246226
C  0.741296 1.309922 0.508613
C  -0.581275 -0.665282 1.955351
C  1.196507 -0.043969 0.396114
C  -2.437316 0.098067 0.493663
C  1.491809 2.344667 -0.084968
C  2.392038 -0.297185 -0.344288
C  2.693129 2.083162 -0.783503
C  3.14189 0.757575 -0.910688
C  -3.444791 1.073382 0.266267
C  -2.525266 -1.156642 -0.16823
C  -4.517062 0.798937 -0.607591
C  -3.615927 -1.429346 -1.02285
C  -4.614894 -0.456652 -1.25275
H  -0.356976 2.066621 2.24056
H  -1.147176 2.362267 0.672653
H  -0.070761 -0.33538 2.878324
H  -1.150439 -1.588329 2.120916
H  1.126333 3.376028 -0.002673
H  3.261641 2.901998 -1.233525
H  4.064239 0.507914 -1.441764
H  -3.407376 2.030797 0.79868
H  -1.730215 -1.900806 -0.051655
H  -5.288034 1.560859 -0.76892
H  -3.668455 -2.399882 -1.528732
H  -5.453136 -0.670419 -1.924054
