program: Gaussian 09
title: 000241205
version: EM64L-G09RevD.01
frameworkgroup: C1[X(C13H19NO2)]
method: RPBEPBE
basis: SDD
operation: Freq
keyword: #p
keyword: freq=noraman
keyword: PBEPBE/SDD
title: #p freq=noraman PBEPBE/SDD
converged: NO YES NO NO
title: Mulliken charges:
elementType: O O N C C C C C C C C C C C C C H H H H H H H H H H H H H H H H H H H
charge: -0.429453 -0.442373 -0.302827 -0.032527 -0.399138 -0.454472 -0.395253 -0.397249 -0.388692 -0.631575 0.388597 0.066864 -0.493494 0.281715 -0.320593 -0.372159 0.217476 0.218685 0.161191 0.188655 0.210578 0.199455 0.202302 0.198918 0.199919 0.199288 0.192329 0.255324 0.206596 0.247075 0.252488 0.248443 0.221098 0.350796 0.352013
chargesum: 0.00000
title: Mulliken charges with hydrogens summed into heavy atoms:
elementType: O O N C C C C C C C C C C C C C
charge: -0.078657 -0.090361 -0.047503 0.184949 -0.019262 -0.055239 0.006504 0.001589 0.002925 -0.177904 0.388597 0.066864 -0.241005 0.281715 -0.072150 -0.151061
polarizability: 1.91171607e+02 1.09790822e+01 1.42651151e+02 1.83513226e+01 -9.49010350e+00 1.22259946e+02
1716.lowfreq: -40.0807 -0.0009 -0.0005 -0.0003 3.5320 8.0010 24.2936 48.6899 64.2806
frequency: 9.0947 47.9002 64.1450 108.9304 124.5353 146.8410 177.8093 228.1735 267.5648 304.8215 314.8417 323.9365 330.2063 332.4248 360.6899 389.0854 416.6517 435.7543 445.7118 456.1257 481.9729 496.2401 519.7566 551.5206 619.3734 660.2363 705.9323 731.5899 760.7334 777.2163 787.0307 801.0741 838.3774 872.7809 878.0806 887.8952 913.6121 920.1885 922.1349 933.7546 977.8025 1027.7144 1048.5752 1055.4788 1072.7458 1100.8568 1110.1881 1121.9495 1136.8441 1144.0840 1145.5262 1162.9563 1176.0447 1203.7488 1238.6546 1245.5389 1253.8152 1257.7868 1275.4494 1298.8526 1306.7053 1313.3432 1322.4296 1335.2700 1340.7910 1342.6549 1347.5502 1363.4416 1395.5822 1450.5556 1459.7645 1463.7041 1466.2923 1467.0389 1473.3811 1473.9065 1482.7923 1492.6193 1592.4501 1640.0571 2863.4809 2937.6907 2963.8701 2969.6873 2972.2858 2973.9392 2988.3220 3015.4014 3023.3217 3031.2460 3035.5960 3044.7321 3046.5529 3120.3561 3140.6420 3169.5827 3419.8466 3566.1400 3588.8688
redmass: 5.3551 4.5393 3.0046 3.6710 4.6314 4.8253 3.8191 1.8084 3.2112 2.1328 1.1379 2.1193 2.2982 2.0605 3.1790 3.3122 2.5872 4.5433 3.2080 2.3994 3.0655 2.9964 1.6973 3.5754 2.2659 2.4512 4.8804 4.6972 3.9803 2.1239 1.4861 1.5435 2.3871 1.5942 1.5469 1.6523 2.3145 1.7314 1.3818 3.4398 2.0853 2.6300 1.7987 1.1200 1.6737 1.6473 2.3321 3.5617 1.5497 2.1460 1.5338 1.5785 1.3462 1.7568 1.3914 1.3852 1.3282 1.2528 2.1962 1.5820 1.3114 1.2892 1.2109 1.3517 1.4604 1.4903 1.4161 1.4771 5.0479 3.1646 1.1357 1.0945 1.0946 1.1391 1.1959 1.2741 1.1099 1.8367 6.6795 6.6643 1.0804 1.0661 1.0590 1.0616 1.0641 1.0647 1.0620 1.0941 1.0994 1.0956 1.1014 1.0999 1.1028 1.0900 1.0916 1.0948 1.0740 1.0659 1.0661
irintensity: 0.2172 0.0523 0.4281 0.4713 0.2692 0.0395 0.8348 0.8872 0.4759 15.3413 134.8208 54.1286 12.6805 87.7266 18.5043 12.3957 6.7044 1.8251 6.6066 6.0085 1.1573 12.9751 14.8143 4.4960 24.3454 85.5596 16.0154 47.3541 13.8696 1.2089 1.7759 47.7815 4.9428 3.2021 18.4758 11.2745 2.4543 1.2569 1.6634 35.0305 16.9083 5.8081 1.6629 0.9799 8.0526 14.0265 1.0475 31.2239 13.4271 24.6675 127.2955 175.0710 21.9446 22.2830 15.0762 2.2110 24.6726 1.3554 18.5462 1.4660 0.7687 0.1426 4.3298 1.0006 0.6635 9.9266 12.7943 9.9608 45.4048 27.1347 7.9072 4.1775 6.1160 13.2982 35.2883 38.0910 11.1334 98.0060 5.8207 5.3701 38.9875 91.1434 39.5291 36.8608 44.7230 14.7340 47.3426 43.5799 33.0036 68.7223 21.3929 17.5444 127.6559 17.1765 5.9689 5.8949 3.3358 86.3894 32.5460
temp: 298.150 k
press: 1.00000 atm
elementType: 8 8 7 6 6 6 6 6 6 6 6 6 6 6 6 6 1 1 1 1 1 1 1 1 1 1 1 1 1 1 1 1 1 1 1
symmnumber: 1
zpe: 782365.2 jmol-1
zpe.correction: 0.297987 hartree
zpe.thermalcorrener: 0.313460 hartree
zpe.thermalcorrenthalpy: 0.314404 hartree
zpe.thermalcorrgfe: 0.254264 hartree
zpe.sumelectzpe: -710.737449 hartree
zpe.sumelectthermal: -710.721976 hartree
zpe.sumelectthermalent: -710.721032 hartree
zpe.sumelectthermalfe: -710.781172 hartree
dipole: 0.2187 -0.1454 -1.1390
dipole: 1.1689
quadrupole: -86.3721 -101.9852 -94.6713
quadrupole: -2.1571 7.2626 0.2510
quadrupole: 7.9708 -7.6423 -0.3284 -2.1571 7.2626 0.2510
hfenergy: -711.0354357 hartree
pointgroup: C01[X(C13H19N1O2)]
dipole: 0.1053034 -0.2312521 0.3833208 debye
polarizability: 188.472036|2.2721774|144.0949745|-25.1584439|7.7704107|123.5156928 unknown
InChI: InChI=1S/C13H19NO2/c15-12-6-7-13(16)10(8-12)9-14-11-4-2-1-3-5-11/h6-8,11,14-16H,1-5,9H2
charge 0 multiplicity 1
35 atoms
O  -0.312873 -1.471198 -1.643754
O  -4.33228 0.807861 1.590202
N  0.974619 1.680337 -0.147676
C  1.875687 0.513643 0.046828
C  2.749412 0.267087 -1.210244
C  2.794591 0.784678 1.26146
C  3.726287 -0.91349 -0.996704
C  3.786608 -0.378033 1.498847
C  4.631193 -0.667696 0.234612
C  -0.202204 1.503682 -1.040947
C  -1.290108 0.545125 -0.536394
C  -1.285978 -0.849914 -0.828418
C  -2.334604 1.052224 0.273795
C  -3.336596 0.205657 0.790687
C  -2.292816 -1.699305 -0.319937
C  -3.319686 -1.178362 0.492821
H  1.305125 -0.423052 0.269526
H  3.308617 1.200479 -1.418886
H  2.126999 0.079561 -2.112364
H  2.174573 0.944372 2.167889
H  3.349787 1.726419 1.074565
H  4.344743 -1.06013 -1.903017
H  3.148885 -1.849276 -0.847537
H  3.222146 -1.291123 1.778533
H  4.447452 -0.136972 2.353668
H  5.288364 -1.541838 0.406748
H  5.292596 0.199654 0.031007
H  0.673903 2.058018 0.763058
H  0.16539 1.208204 -2.043253
H  -0.65493 2.502758 -1.177272
H  -2.382295 2.122097 0.506696
H  -2.258623 -2.762938 -0.573245
H  -4.097572 -1.846363 0.884623
H  0.393585 -0.829725 -1.905065
H  -4.996097 0.136154 1.883452
