program: Gaussian 09
title: 000241194
version: EM64L-G09RevD.01
frameworkgroup: C1[X(C18H15N)]
method: RPBEPBE
basis: SDD
operation: Freq
keyword: #pfreq=noraman
keyword: PBEPBE/SDD
title: #p freq=noraman PBEPBE/SDD
converged: NO YES NO NO
title: Mulliken charges:
elementType: N C C C C C C C C C C C C C C C C C C H H H H H H H H H H H H H H H
charge: -0.159421 0.342997 0.187965 -0.683829 0.154072 0.288760 0.214765 0.332053 -0.593390 -0.389286 -0.334410 -0.430485 -0.359457 -0.448949 -0.638273 -0.281424 -0.227240 -0.245642 -0.232517 0.236825 0.236758 0.238870 0.252580 0.221167 0.238531 0.234432 0.243039 0.232140 0.241531 0.241321 0.222058 0.222099 0.221311 0.221049
chargesum: 0.00000
title: Mulliken charges with hydrogens summed into heavy atoms:
elementType: N C C C C C C C C C C C C C C C C C C
charge: -0.159421 0.342997 0.187965 -0.210246 0.154072 0.288760 0.214765 0.332053 -0.354520 -0.136705 -0.113243 -0.191954 -0.125025 -0.205910 0.076719 -0.059367 -0.005140 -0.024331 -0.011469
polarizability: 3.71260389e+02 6.89634913e+00 2.21469448e+02 2.13196552e-02 -4.13063500e-03 8.51915591e+01
1716.lowfreq: -10.9626 -3.9161 -1.6447 -0.0010 -0.0008 -0.0006 19.9579 50.4236 79.8554
frequency: 19.7140 50.4152 79.8554 83.9167 132.1680 137.0335 204.1342 206.5991 231.8270 249.2641 266.8139 285.7088 343.6597 417.3147 423.3658 426.3948 473.7520 530.1472 554.5814 554.8116 570.9755 575.4193 593.1742 594.3229 640.8473 715.7911 725.2694 747.1065 757.6404 761.7774 769.9995 773.0646 790.0121 842.6085 846.3612 857.0699 871.3629 876.5231 925.6206 928.0808 931.3959 954.9029 971.7117 979.4511 1016.6474 1018.5805 1035.6792 1076.6307 1097.5178 1118.2756 1123.8072 1133.9440 1138.5893 1165.5623 1170.7232 1180.5914 1199.0413 1204.2497 1233.0023 1261.3051 1285.9065 1301.0696 1340.8364 1351.7694 1381.9476 1400.1525 1411.5232 1423.7307 1433.3196 1448.1872 1464.0731 1466.4379 1472.1201 1478.2838 1496.3418 1517.2929 1579.6035 1589.8498 1605.7372 1619.8149 1626.2898 2975.5462 2978.4059 3022.1498 3055.4858 3108.3058 3116.4191 3124.5833 3126.5214 3138.7819 3138.8575 3155.7612 3157.8973 3171.6146 3191.0351 3215.5893
redmass: 3.7331 4.4941 4.6807 1.1096 3.4441 3.1693 2.4766 4.4604 4.1750 3.8084 4.3771 4.9308 3.4876 2.5058 2.7583 3.8486 3.0262 5.4143 5.5119 2.9670 3.6922 4.5915 6.4823 5.6107 2.8815 5.6209 1.8753 1.3211 5.1997 1.8382 2.6779 4.1168 1.5574 1.4768 5.1576 1.3776 5.2647 1.5936 1.6916 3.8495 1.3947 1.7859 1.3085 1.3237 2.1812 2.1332 2.5834 2.4363 1.8890 1.3075 1.1408 1.5803 1.6907 1.1141 1.1653 1.6988 1.6281 1.5481 2.0096 1.9247 3.0035 1.6327 2.3443 4.8793 3.8393 3.3827 3.6209 1.3286 1.4570 2.5492 3.3473 1.0415 2.4463 2.8241 1.2389 3.9125 6.5805 6.8871 7.2389 7.3963 7.2533 1.0602 1.0355 1.0990 1.1018 1.0988 1.0858 1.0890 1.0851 1.0921 1.0924 1.0960 1.1002 1.0977 1.0943 1.0971
irintensity: 0.0036 1.0536 0.0967 0.1920 0.8699 3.1377 2.4186 0.1687 3.0117 0.3037 2.0435 2.1011 1.9743 7.7510 13.2779 2.3999 0.4512 0.5198 15.3325 3.0933 0.0779 2.1067 3.1698 4.1510 0.0676 2.0499 27.7838 125.7272 7.2150 21.5841 0.0282 2.4002 34.8550 10.7037 0.1581 4.6572 0.5572 21.8918 2.2252 8.6974 4.5565 5.2436 0.0005 0.0278 3.0390 23.5487 15.3060 36.0245 5.7132 0.7312 1.2437 23.2387 24.6782 0.1997 9.9878 0.2218 12.1693 3.7154 6.4498 35.8415 3.1290 1.4298 62.9116 111.9863 20.9993 5.3608 14.6741 7.9081 3.9646 13.6896 27.9215 14.1861 8.0043 48.2766 11.0723 37.3221 7.8297 23.6501 124.6448 1.3736 3.2526 16.2620 96.3219 9.2397 26.0107 10.9368 5.4927 4.9558 0.1083 3.8817 45.9081 49.2548 44.3547 11.6784 22.9940 1.8377
temp: 298.150 k
press: 1.00000 atm
elementType: 7 6 6 6 6 6 6 6 6 6 6 6 6 6 6 6 6 6 6 1 1 1 1 1 1 1 1 1 1 1 1 1 1 1
symmnumber: 1
zpe: 719059.5 jmol-1
zpe.correction: 0.273875 hartree
zpe.thermalcorrener: 0.289017 hartree
zpe.thermalcorrenthalpy: 0.289961 hartree
zpe.thermalcorrgfe: 0.230502 hartree
zpe.sumelectzpe: -748.380971 hartree
zpe.sumelectthermal: -748.365829 hartree
zpe.sumelectthermalent: -748.364885 hartree
zpe.sumelectthermalfe: -748.424344 hartree
dipole: 2.7982 2.9936 0.0003
dipole: 4.0978
quadrupole: -97.1198 -91.4576 -119.4991
quadrupole: 7.4967 0.0075 -0.0075
quadrupole: 5.5724 11.2346 -16.8070 7.4967 0.0075 -0.0075
hfenergy: -748.6548463 hartree
pointgroup: C01 [X(C18H15N1)]
dipole: 1.0899608 -1.1874423 0.033149 debye
polarizability: 371.0776636|-8.4026763|221.4067393|-3.1929719|-5.2468116|85.4369929 unknown
InChI: InChI=1S/C18H15N/c1-19-12-17(16-8-4-5-9-18(16)19)15-10-13-6-2-3-7-14(13)11-15/h2-10,12H,11H2,1H3
charge 0 multiplicity 1
34 atoms
N  2.804966 -1.636964 0.037384
C  -0.627347 -0.255011 0.023626
C  0.80913 -0.480144 0.015106
C  -1.6273 -1.418825 0.083384
C  1.912334 0.481212 -0.035694
C  -2.983228 -0.731344 0.072866
C  3.138509 -0.274925 -0.020163
C  -2.77334 0.683125 0.012766
C  -1.329901 0.938438 -0.015995
C  1.41333 -1.750741 0.057423
C  1.999696 1.897238 -0.092125
C  -4.279937 -1.264294 0.111205
C  4.41429 0.329068 -0.058566
C  -3.876475 1.567918 -0.008874
C  3.765757 -2.739588 0.06642
C  3.267949 2.509769 -0.13059
C  4.464654 1.735869 -0.114208
C  -5.388526 -0.374655 0.089423
C  -5.184366 1.025606 0.029977
H  -1.482681 -2.029111 0.997279
H  -1.505903 -2.101173 -0.781637
H  -0.899875 1.940346 -0.062313
H  0.942444 -2.731773 0.101804
H  1.099251 2.517243 -0.10571
H  -4.445451 -2.347469 0.157263
H  5.33292 -0.267788 -0.046191
H  -3.727489 2.652809 -0.054483
H  3.223323 -3.696366 0.124893
H  4.389544 -2.746388 -0.846747
H  4.4311 -2.661221 0.946138
H  3.339711 3.602143 -0.173824
H  5.435239 2.243317 -0.145383
H  -6.408558 -0.774283 0.118735
H  -6.050872 1.696958 0.01401
