program: Gaussian 09
title: 000241181
version: EM64L-G09RevD.01
frameworkgroup: C1[X(C6H8ClN3)]
method: RPBEPBE
basis: SDD
operation: Freq
keyword: #p
keyword: freq=noraman
keyword: PBEPBE/SDD
title: #p freq=noraman PBEPBE/SDD
converged: YES YES NO NO
title: Mulliken charges:
elementType: Cl N N N C C C C C C H H H H H H H H
charge: -0.018767 -0.385804 0.005713 0.055645 0.300934 0.172725 -0.816953 -0.380725 -0.605789 -0.338648 0.326299 0.233746 0.244401 0.229847 0.250438 0.274559 0.240713 0.211668
chargesum: 0.00000
title: Mulliken charges with hydrogens summed into heavy atoms:
elementType: Cl N N N C C C C C C
charge: -0.018767 -0.059505 0.005713 0.055645 0.300934 0.172725 -0.108960 -0.130287 0.121151 -0.338648
polarizability: 1.33184162e+02 -1.61540307e+00 1.07297535e+02 -1.73036491e-01 6.76889113e-01 4.72253562e+01
1716.lowfreq: -57.7458 -6.4884 -3.1989 -0.0027 -0.0025 -0.0006 4.2579 88.3715 131.3070
frequency: -57.6940 88.3619 131.3045 167.2553 177.4688 207.5449 250.5997 316.3870 341.6364 373.3692 441.2969 459.5454 500.3231 552.0289 640.1804 657.6565 752.8226 764.4956 882.3172 916.7986 989.4715 1045.5026 1056.1660 1091.9060 1119.9456 1150.4526 1192.1670 1261.6659 1332.8727 1348.9600 1392.4111 1412.0118 1423.5234 1454.6197 1465.4514 1471.5399 1477.1413 1498.8214 1561.0190 1577.7224 2958.6897 2983.4926 3030.1430 3073.5718 3085.1460 3119.0721 3135.2386 3591.2526
redmass: 1.0378 4.6553 3.4284 3.6413 1.1155 4.1183 3.3126 4.2199 4.6581 10.7224 3.1748 1.2090 5.1469 4.1192 7.0727 9.8191 5.8390 7.4414 5.1374 1.3650 1.5451 1.5068 5.5821 2.3404 1.3046 2.8005 3.2491 3.6448 1.8935 5.3551 1.4394 1.3533 1.6641 1.1234 1.7489 1.0491 1.1918 1.2007 3.3526 4.8619 1.0387 1.0393 1.0980 1.0951 1.0961 1.1016 1.0930 1.0773
irintensity: 0.1939 0.3185 4.7815 1.4463 0.9869 0.4719 0.3347 5.7070 4.0155 11.8146 3.5679 103.4598 4.4058 3.4964 14.7456 0.8761 2.5601 11.1902 72.9893 10.9721 18.0887 5.4303 27.7425 51.8740 14.4848 27.0993 22.6456 96.1088 62.6239 139.8172 66.8039 21.0931 35.3494 24.0304 9.4753 15.9116 19.8571 30.9350 37.3474 531.6542 35.0176 65.2989 22.0265 30.0779 13.8175 10.6537 20.9153 47.7973
temp: 298.150 k
press: 1.00000 atm
elementType: 17 7 7 7 6 6 6 6 6 6 1 1 1 1 1 1 1 1
symmnumber: 1
zpe: 358409.4 jmol-1
zpe.correction: 0.136511 hartree
zpe.thermalcorrener: 0.145903 hartree
zpe.thermalcorrenthalpy: 0.146847 hartree
zpe.thermalcorrgfe: 0.101571 hartree
zpe.sumelectzpe: -857.007222 hartree
zpe.sumelectthermal: -856.997830 hartree
zpe.sumelectthermalent: -856.996886 hartree
zpe.sumelectthermalfe: -857.042163 hartree
dipole: -7.1372 0.5578 0.0433
dipole: 7.1591
quadrupole: -62.4255 -61.0430 -67.2234
quadrupole: 0.5233 -0.2489 -0.0428
quadrupole: 1.1385 2.5209 -3.6595 0.5233 -0.2489 -0.0428
hfenergy: -857.1437333 hartree
pointgroup: C01 [X(C6H8Cl1N3)]
dipole: -2.7616167 0.5415726 -0.1162126 debye
dipolederiv: -0.7283974 0.3539933 -0.0262634 0.4564016 -0.3944299 0.0187888 -0.0246566 0.0142061 -0.0940434 -1.0885155 -0.6133484 -0.011161 -0.4500923 -0.6312963 -0.0601229 0.0994637 0.0307165 -0.4876626 -1.3651813 -0.1603286 -0.0481627 0.0460962 -0.4267685 0.0018252 -0.0444551 -0.0126816 -0.1751383 -0.8177156 -0.0191838 -0.0256804 0.5931116 -1.0006644 0.0226569 -0.0271685 0.0081331 -0.165393 -0.281672 -0.2484085 -0.0116408 -0.5878471 -0.3719753 -0.0207013 -0.0116914 -0.0061442 -0.0240813 1.4568013 0.7104387 0.0441021 0.6286669 0.5723598 0.0273205 0.035152 0.0188852 0.185065 -0.0497579 0.0575398 -0.0031254 0.0486352 0.0261134 0.0029768 0.0037903 0.0022877 0.0974252 0.6978369 0.1013141 0.0274634 -0.1265533 0.4302089 -0.0064789 0.0246375 -0.0005333 -0.0818752 0.1610202 0.0621375 -0.0279408 0.2283246 0.5253979 0.0876268 -0.0850027 0.0299287 0.2326085 1.6782411 -0.3083178 0.068298 -0.6990033 1.2379789 -0.0321428 0.0672395 -0.0186758 0.0270128 0.2145102 0.0521902 -0.009685 -0.0179407 0.0880153 0.0103946 -0.0441707 0.0090629 0.3171993 -0.040855 0.050454 0.0961072 -0.0127022 0.0756415 0.0677568 0.1192633 0.009034 -0.036049 0.0761774 -0.1131448 -0.0012385 0.0155808 -0.1185538 0.000795 -0.0017545 -0.0038413 0.1188718 -0.0321751 0.050795 -0.0981205 -0.0115572 0.0737144 -0.0701203 -0.1226303 -0.0067844 -0.0510631 0.0899735 0.0198571 -0.0011491 0.025343 -0.1157821 0.0016441 -0.001275 0.0014731 0.1267606 0.0682133 0.0962517 -0.0915543 -0.0012236 0.0487818 0.0139194 -0.0599345 0.0500265 0.0391041 0.0974905 0.0175054 0.0347088 -0.0966524 -0.0579208 -0.0579852 -0.0181526 -0.1339859 -0.1193299 -0.1359945 -0.1097446 0.0850427 -0.0385878 0.0391791 -0.0081533 0.0913455 0.0088926 0.0905885 unknown
polarizability: 132.0241849|-5.3193957|108.3258615|3.3784671|0.3375128|47.3570068 unknown
InChI: InChI=1S/C6H8ClN3/c1-4-3-9-6(7)10-5(4)8-2/h3,8H,1-2H3
charge 0 multiplicity 1
18 atoms
Cl 3.019131 -1.433808 0.129936
N  -1.976352 -0.843226 -0.04135
N  0.366878 -1.002768 0.025892
N  1.788662 0.965865 0.071171
C  -0.653698 1.230335 -0.010171
C  -0.755703 -0.209532 -0.010701
C  -1.877535 2.115981 -0.04689
C  0.651093 1.743987 0.029795
C  -2.121597 -2.305228 -0.062699
C  1.547372 -0.358069 0.069623
H  -2.812178 -0.266806 -0.123977
H  -2.534538 1.944265 0.828946
H  -1.590677 3.180967 -0.038331
H  -2.482569 1.946912 -0.960316
H  0.821339 2.826794 0.030203
H  -1.355569 -2.759778 0.584486
H  -1.984507 -2.717023 -1.080857
H  -3.125251 -2.576069 0.30574
