program: Gaussian 09
title: 000241177
version: EM64L-G09RevD.01
frameworkgroup: C1[X(C6H6N4O)]
method: RPBEPBE
basis: SDD
operation: Freq
keyword: #pfreq=noraman
keyword: PBEPBE/SDD
title: #p freq=noraman PBEPBE/SDD
converged: NO YES NO NO
title: Mulliken charges:
elementType: O N N N N C C C C C C H H H H H H
charge: -0.441207 -0.416853 -0.005038 0.040172 0.008674 0.253753 0.129860 -0.110078 -0.418341 -0.355949 -0.384719 0.338892 0.256919 0.246610 0.250572 0.252760 0.353975
chargesum: 0.00000
title: Mulliken charges with hydrogens summed into heavy atoms:
elementType: O N N N N C C C C C C
charge: -0.087232 -0.077961 -0.005038 0.040172 0.008674 0.253753 0.129860 -0.110078 0.085188 -0.105377 -0.131959
polarizability: 1.38097377e+02 1.81093330e+00 8.88296874e+01 2.59481650e+00 -1.02428782e+00 4.65125469e+01
1716.lowfreq: -4.3715 0.0009 0.0011 0.0013 5.6436 7.4756 65.6233 117.1793 179.1659
frequency: 65.6120 117.1768 179.1646 230.8994 294.3270 359.6167 364.7052 426.3454 480.3938 562.1814 614.2343 628.2200 658.9812 693.5498 704.6583 803.5319 811.8085 864.6163 891.7141 937.7653 940.3660 961.3538 991.9973 1076.9409 1145.9467 1163.1655 1201.5653 1243.0065 1284.1259 1303.9837 1317.8842 1338.8279 1366.6889 1377.7027 1416.5725 1457.8953 1495.3636 1532.0669 1589.1885 3017.3055 3079.4996 3134.2042 3173.8802 3565.1968 3573.9276
redmass: 4.3225 4.5292 4.3587 4.2697 3.1956 3.8369 1.4554 4.1190 5.2057 8.1195 4.5520 6.7743 6.0176 1.1062 6.2906 6.5486 5.4910 7.5838 1.4758 2.2385 1.6612 3.5707 3.3041 3.7700 1.2216 4.4187 1.6992 5.3032 3.4895 1.9647 2.1924 1.6025 2.0053 1.8386 1.7243 1.0940 5.2758 8.4995 7.3167 1.0587 1.1055 1.0932 1.0925 1.0667 1.0816
irintensity: 14.1497 3.8486 5.3508 12.2662 12.5078 63.3365 134.9861 5.9953 6.3791 4.9729 5.5778 0.2925 4.5499 107.7065 1.7306 8.0562 3.5603 13.4809 29.6875 54.7315 19.3410 5.0739 24.0888 11.6824 40.6915 13.3559 39.5663 15.9939 0.3628 10.1164 24.4182 60.3815 115.9312 36.0805 4.2594 15.7053 69.5656 11.7940 13.2119 18.5895 8.1494 14.6896 14.6705 13.3727 80.1886
temp: 298.150 k
press: 1.00000 atm
elementType: 8 7 7 7 7 6 6 6 6 6 6 1 1 1 1 1 1
symmnumber: 1
zpe: 325612.5 jmol-1
zpe.correction: 0.124019 hartree
zpe.thermalcorrener: 0.132574 hartree
zpe.thermalcorrenthalpy: 0.133519 hartree
zpe.thermalcorrgfe: 0.090001 hartree
zpe.sumelectzpe: -525.662073 hartree
zpe.sumelectthermal: -525.653517 hartree
zpe.sumelectthermalent: -525.652573 hartree
zpe.sumelectthermalfe: -525.696091 hartree
dipole: -3.9474 3.2997 0.6980
dipole: 5.1921
quadrupole: -67.0814 -67.8113 -60.5420
quadrupole: 1.0860 -4.0823 0.9268
quadrupole: -1.9365 -2.6664 4.6029 1.0860 -4.0823 0.9268
hfenergy: -525.7860918 hartree
pointgroup: C01 [X(C6H6N4O1)]
dipole: 1.4089062 -1.4508725 -0.2874601 debye
dipolederiv: -0.8513371 0.0728521 -0.1094685 0.2217098 -0.6299196 0.0200937 -0.1207493 0.0280181 -0.1416748 -0.6630448 -0.0634788 -0.0405955 0.0931002 -0.4838721 -0.1233881 0.1084561 -0.141361 -0.3149552 -0.8296139 0.2137907 0.0979942 0.0922028 -0.3544992 -0.0504418 0.0086971 -0.0356629 -0.2923667 -0.4821622 0.04748 0.0202242 -0.0112834 -0.2999961 -0.0517977 -0.0032793 -0.0557997 -0.227522 -0.6003712 -0.0144336 -0.0099488 0.1909323 -0.3810219 -0.0896152 0.1062153 -0.0915949 -0.2542381 0.1434391 -0.1661338 -0.093192 -0.5578615 -0.2048196 -0.1867575 -0.2894249 -0.1822347 0.0517114 0.3924467 0.0572178 -0.0074746 -0.009037 0.543071 0.3154075 -0.1573987 0.2988297 0.1837948 0.7394804 -0.1230623 -0.0588679 0.3673251 0.1730377 0.0434037 0.2143909 0.0359709 0.1122672 0.4844424 -0.1288682 0.0520375 -0.2959184 0.5138554 -0.0556758 0.1710021 -0.0813384 0.2386379 0.4650946 0.1425489 0.0757715 0.0193514 0.2854252 0.182488 -0.0020152 0.1849423 0.0358272 0.4497279 -0.095888 -0.0496483 -0.214214 0.2908623 0.1786764 -0.116295 0.1805248 0.0397961 0.2596514 -0.0256053 0.0005891 -0.0328384 0.2399512 -0.0522848 -0.0064097 -0.0432394 0.3318839 -0.0265961 -0.0035033 0.0352027 0.0767436 0.0436781 0.0442114 0.0628086 0.0859882 -0.015902 0.0362453 0.0208583 -0.0382845 -0.0070646 -0.0262521 -0.0738329 -0.0860869 -0.098347 -0.0018356 0.0878393 0.0124991 0.0061726 0.0070543 -0.041103 -0.092631 0.004839 -0.0928895 0.0881649 -0.0433793 0.0663024 0.0338651 0.0633978 0.0669704 -0.0366494 0.0317433 -0.0361525 0.1178477 0.4381376 -0.0125759 0.0856235 -0.0036001 0.2646326 0.0287935 0.0735065 0.044346 0.0485633 unknown
polarizability: 138.0402522|-3.2222251|80.953224|-0.099038|16.6348569|54.446135 unknown
InChI: InChI=1S/C6H6N4O/c11-2-5-9-4-1-7-3-8-6(4)10-5/h1,3,9,11H,2H2
charge 0 multiplicity 1
17 atoms
O  3.601876 -1.250841 0.04323
N  0.840064 -0.947182 -0.423892
N  0.783123 1.081788 0.647278
N  -1.692682 1.266787 0.737467
N  -2.902732 -0.636132 -0.250595
C  -0.512248 -0.646479 -0.262659
C  1.564536 0.114356 0.135306
C  -0.532148 0.635725 0.405643
C  3.068685 0.12288 0.07674
C  -1.736229 -1.265128 -0.578736
C  -2.819058 0.58367 0.383522
H  1.273739 -1.775379 -0.833077
H  3.413847 0.576655 -0.868396
H  3.464879 0.72433 0.914947
H  -1.816896 -2.234199 -1.083576
H  -3.773357 1.057063 0.630459
H  3.588896 -1.630315 0.958239
